program: Gaussian 09
title: 000248032
version: EM64L-G09RevD.01
frameworkgroup: C1[X(C12H17Cl2N5O2)]
method: RPBEPBE
basis: SDD
operation: Freq
keyword: #p
keyword: freq=noraman
keyword: PBEPBE/SDD
title: #p freq=noraman PBEPBE/SDD
converged: YES YES NO NO
title: Mulliken charges:
elementType: Cl Cl O O N N N N N C C C C C C C C C C C C H H H H H H H H H H H H H H H H H
charge: -0.058908 -0.056783 -0.266491 -0.255180 -0.137245 -0.176105 -0.083114 -0.165347 -0.405144 -0.486101 0.201106 0.142723 0.090257 -0.320025 -0.313679 -0.649849 0.107405 0.165579 -0.589266 -0.585301 -0.613299 0.225246 0.256328 0.266385 0.235510 0.242552 0.235775 0.296474 0.239200 0.257885 0.271665 0.261818 0.268822 0.262344 0.366047 0.248051 0.248748 0.271917
chargesum: 0.00000
title: Mulliken charges with hydrogens summed into heavy atoms:
elementType: Cl Cl O O N N N N N C C C C C C C C C C C C
charge: -0.058908 -0.056783 -0.266491 -0.255180 -0.137245 -0.176105 -0.083114 -0.165347 -0.039097 -0.004526 0.201106 0.142723 0.090257 0.181870 0.164649 0.143710 0.107405 0.165579 -0.055782 -0.054135 0.155417
polarizability: 2.57814586e+02 -2.25170143e+01 1.68265933e+02 -9.89819044e+00 -2.29016717e+01 1.58850537e+02
1716.lowfreq: -6.7931 -5.3001 -0.0013 -0.0007 -0.0005 3.5170 13.2138 21.0783 30.7190
frequency: 12.6741 21.0652 30.7127 33.5140 65.2593 71.3221 78.6104 87.3019 94.2096 100.1364 115.9471 122.9060 143.5963 190.5967 194.8310 203.6827 232.6696 240.9223 247.9930 271.3258 288.7264 319.7339 355.8670 371.0886 381.7225 408.0114 413.8759 438.2099 472.5956 519.3482 579.6531 629.3717 661.1597 666.9294 680.3956 684.4110 692.3194 706.4152 733.4217 749.7536 765.6831 774.5601 782.7467 815.9697 834.1219 935.6255 961.2069 994.1618 1004.9646 1020.3876 1057.7645 1062.5645 1086.2670 1106.5208 1113.6635 1130.4720 1132.5371 1146.9021 1171.1300 1185.7898 1197.3363 1222.3649 1240.1322 1254.6876 1260.8794 1273.5023 1284.5038 1290.2146 1298.0364 1354.8048 1359.6325 1362.7917 1364.8401 1374.0199 1392.5319 1423.2158 1444.0427 1452.8080 1454.7888 1462.5985 1467.7311 1475.5141 1477.8493 1479.7823 1482.6597 1483.8007 1496.4139 1513.1269 1572.4740 1645.9532 1659.4964 2938.1384 2941.4311 2946.9186 2993.9868 3008.7611 3020.3092 3054.7067 3055.5138 3059.8455 3066.1328 3087.7798 3099.3500 3124.2416 3138.4124 3142.5669 3144.1221 3528.6595
redmass: 6.2831 11.2577 7.7446 8.0158 2.6842 3.3569 1.8818 1.7143 1.3446 1.9177 3.2754 4.7840 5.8340 4.7477 6.6825 3.4751 5.0303 4.9824 3.7899 2.8795 3.9313 3.4786 6.5084 4.6522 6.2686 5.3072 5.7372 4.5686 4.0994 5.8955 6.8108 3.5780 4.9023 6.3370 6.1311 5.2354 4.8362 6.5642 3.2861 6.7849 3.0529 1.1642 1.1514 4.2651 4.3264 2.4736 2.4041 1.7642 1.4787 3.8801 2.7732 2.6619 2.0115 2.0981 2.5533 1.3115 1.2980 2.8669 2.3340 2.5196 2.6789 1.6341 1.5021 1.2327 1.3980 3.7267 1.1497 5.3956 1.2317 1.9672 1.6214 1.3149 2.0775 1.3962 2.1663 1.2542 2.1370 1.1058 1.1011 1.3494 1.4164 1.2929 1.0442 1.0847 1.0831 1.1985 1.4115 2.7061 8.2556 9.0379 6.2836 1.0657 1.0687 1.0682 1.0351 1.0334 1.0946 1.0690 1.0627 1.0791 1.0898 1.0997 1.1026 1.1034 1.1015 1.1117 1.1115 1.0769
irintensity: 0.1286 0.6531 2.0923 0.9809 1.5976 0.5192 2.2540 0.3287 0.1900 0.3066 5.1598 3.1814 2.1972 2.4980 10.1270 15.9290 7.5028 2.7973 3.6319 0.1950 1.9780 0.4777 5.8581 27.4603 1.4569 2.1716 4.3047 12.9083 1.7802 10.8015 10.4310 10.5986 8.8363 7.2135 117.4574 33.8238 6.6697 6.6717 26.9988 7.0115 91.6738 8.9105 7.2573 20.4731 10.3966 0.7919 9.0295 24.2241 4.0637 9.7867 15.2813 5.1079 26.5266 56.6892 74.3253 4.3182 0.2654 10.9617 3.0156 11.8295 64.2907 20.9728 16.6296 12.7193 1.5820 46.3801 8.4438 42.9700 4.9187 9.3189 30.8505 2.9524 4.1726 6.2231 47.2432 4.5467 149.4692 2.6614 11.4876 29.8250 5.6919 23.0556 16.1575 14.0069 8.9257 28.8308 46.1002 43.6462 77.2896 610.0857 602.3015 22.3797 21.6127 86.9812 34.1369 29.6405 12.9558 13.7829 16.3462 21.3880 9.7475 9.0126 17.0848 1.6500 0.4656 15.3883 20.4664 78.2708
temp: 298.150 k
press: 1.00000 atm
elementType: 17 17 8 8 7 7 7 7 7 6 6 6 6 6 6 6 6 6 6 6 6 1 1 1 1 1 1 1 1 1 1 1 1 1 1 1 1 1
symmnumber: 1
zpe: 773198.7 jmol-1
zpe.correction: 0.294496 hartree
zpe.thermalcorrener: 0.316701 hartree
zpe.thermalcorrenthalpy: 0.317645 hartree
zpe.thermalcorrgfe: 0.238748 hartree
zpe.sumelectzpe: -1810.246711 hartree
zpe.sumelectthermal: -1810.224506 hartree
zpe.sumelectthermalent: -1810.223562 hartree
zpe.sumelectthermalfe: -1810.302459 hartree
dipole: 2.8211 -1.4751 -2.1601
dipole: 3.8471
quadrupole: -172.5099 -149.2188 -140.5064
quadrupole: -0.0385 4.2764 -0.5648
quadrupole: -18.4315 4.8596 13.5720 -0.0385 4.2764 -0.5648
hfenergy: -1810.5412071 hartree
pointgroup: C01 [X(C12H17Cl2N5O2)]
dipole: -1.088315 0.4167838 -0.9658119 debye
polarizability: 254.1763909|-25.3599636|183.9432208|15.9961721|15.5221542|146.8114445 unknown
InChI: InChI=1S/C12H17Cl2N5O2/c1-17-8(7-19(5-3-13)6-4-14)15-10-9(17)11(20)16-12(21)18(10)2/h16H,3-7H2,1-2H3
charge 0 multiplicity 1
38 atoms
Cl -2.741301 -3.31402 2.440337
Cl -6.202431 2.094245 -0.624528
O  2.466691 2.298934 1.800682
O  5.215312 -1.029047 -0.036357
N  -2.750259 -0.189934 -0.284482
N  0.167467 1.075509 0.00579
N  0.576555 -0.739356 -1.322375
N  2.970789 -1.004092 -0.754657
N  3.77534 0.603245 0.821729
C  -1.786569 0.163488 -1.367631
C  -0.359511 0.164694 -0.901428
C  1.518177 0.740676 0.175495
C  1.734912 -0.375272 -0.65488
C  -2.584604 -1.565026 0.256674
C  -4.151113 0.179057 -0.614879
C  -0.528727 2.206772 0.646777
C  2.552172 1.315186 1.003681
C  4.063351 -0.518037 0.000666
C  -2.868802 -1.553468 1.764039
C  -4.443567 1.606476 -0.13142
C  3.150989 -2.173965 -1.635936
H  -2.059313 1.168475 -1.743159
H  -1.843334 -0.538075 -2.228977
H  -1.54592 -1.896835 0.087606
H  -3.24885 -2.30003 -0.248697
H  -4.842883 -0.517814 -0.109933
H  -4.357631 0.102133 -1.705232
H  0.096906 2.5768 1.47313
H  -0.678502 3.029139 -0.075954
H  -1.505462 1.861419 1.021703
H  -2.127661 -0.957693 2.315691
H  -3.890198 -1.220953 2.004597
H  -4.400229 1.685204 0.964445
H  -3.78945 2.357971 -0.59933
H  4.575567 0.93814 1.367666
H  2.897113 -1.907028 -2.675129
H  2.494177 -2.99854 -1.311993
H  4.204799 -2.481281 -1.568236
