program: Gaussian 09
title: 000248031
version: EM64L-G09RevD.01
frameworkgroup: C1[X(C12H17Cl2N5O2)]
method: RPBEPBE
basis: SDD
operation: Freq
keyword: #p
keyword: freq=noraman
keyword: PBEPBE/SDD
title: #p freq=noraman PBEPBE/SDD
converged: YES YES NO NO
title: Mulliken charges:
elementType: Cl Cl O O N N N N N C C C C C C C C C C C C H H H H H H H H H H H H H H H H H
charge: -0.053826 -0.052710 -0.264522 -0.263234 -0.137545 -0.396793 -0.165078 -0.053666 -0.219707 -0.471167 0.184042 0.118611 0.064501 -0.301483 -0.319698 0.125803 0.205757 -0.580733 -0.585884 -0.614989 -0.598244 0.245609 0.241982 0.339169 0.232257 0.232376 0.237446 0.232233 0.264761 0.266774 0.263523 0.285743 0.273842 0.246723 0.246563 0.268284 0.251591 0.251688
chargesum: 0.00000
title: Mulliken charges with hydrogens summed into heavy atoms:
elementType: Cl Cl O O N N N N N C C C C C C C C C C C C
charge: -0.053826 -0.052710 -0.264522 -0.263234 -0.137545 -0.057624 -0.165078 -0.053666 -0.219707 0.016424 0.184042 0.118611 0.064501 0.163151 0.149981 0.125803 0.205757 -0.049198 -0.036618 0.152139 0.173319
polarizability: 2.57060239e+02 -8.11698866e+00 1.60546326e+02 9.13673496e+00 1.91101299e+01 1.67865073e+02
1716.lowfreq: -11.2058 -5.8586 -3.5373 0.0016 0.0024 0.0027 9.5693 20.9338 30.6127
frequency: 7.7892 20.9083 30.6093 32.7780 60.5006 72.8355 80.1645 90.7985 95.3089 100.7945 116.7210 119.0616 144.2927 172.4180 186.4477 194.2273 220.9111 251.9924 287.1105 299.4991 310.4354 328.9909 349.4952 366.9430 379.3999 392.1871 431.5637 446.5664 481.5108 503.8111 544.7095 635.7476 662.3007 673.1607 688.5164 691.3873 704.9451 735.3488 741.0329 746.6991 766.8181 781.7673 785.1147 844.2543 926.3661 954.0312 963.6003 985.3222 1001.0525 1012.5086 1039.1865 1059.4003 1063.9356 1096.4603 1104.3958 1115.7610 1129.5181 1132.1082 1170.1112 1178.1119 1198.3643 1215.6285 1226.8297 1243.4338 1255.7346 1261.2839 1263.3190 1290.9012 1295.3225 1306.8908 1319.5663 1362.8534 1373.8707 1380.2870 1405.0257 1417.1708 1427.7224 1445.4188 1453.3356 1455.4496 1466.7579 1472.3677 1474.0716 1478.1628 1479.3442 1479.8922 1485.4307 1521.7752 1579.1860 1616.0704 1657.8232 2924.4110 2941.5252 2949.6664 3007.4760 3012.7367 3017.1303 3056.7575 3059.2058 3063.0407 3065.7882 3096.7970 3105.3447 3138.6967 3139.7362 3143.6625 3149.3609 3575.3218
redmass: 8.4818 6.6963 7.4712 5.3219 3.1315 4.1887 2.5811 3.5981 1.0484 1.1866 3.9606 4.1641 3.5010 6.5720 4.5545 5.1611 5.9521 5.0756 3.9948 3.6109 4.3552 4.1350 3.6349 6.6719 4.1430 7.0437 5.4284 2.9479 7.1610 5.8094 5.9004 6.9041 7.5346 8.3332 7.0247 5.3849 11.0276 1.2805 3.4839 6.4918 4.8810 1.1691 1.1502 5.0900 4.0837 2.1491 3.3426 4.4876 1.6875 1.4934 3.0921 2.6068 3.7784 2.0547 3.0797 1.9680 1.3046 1.2994 1.3611 2.0523 2.2456 1.6537 2.7705 1.2909 1.3013 3.8018 1.4612 2.0205 1.8646 1.3895 1.4073 1.4708 2.7321 1.8372 2.2585 1.2837 1.3003 1.2143 1.0923 1.1744 1.6593 1.0437 1.0961 1.0844 1.0693 1.0808 1.5827 4.2101 8.2779 10.5992 10.5610 1.0693 1.0650 1.0679 1.0337 1.0327 1.0956 1.0595 1.0805 1.0711 1.0872 1.1026 1.1022 1.1026 1.1011 1.1119 1.1120 1.0814
irintensity: 0.7590 0.0215 0.9375 0.4012 1.7386 0.8295 0.7379 2.5715 0.0526 1.1960 2.9709 2.0605 2.5477 2.0170 1.6457 16.9079 4.6060 3.2004 3.8727 0.3692 4.4588 21.1679 6.4161 6.7034 31.0560 10.5958 3.7486 1.8958 18.6355 12.6659 5.6786 1.5983 7.9459 11.8914 30.5356 79.7544 10.5712 96.8391 21.8683 1.2295 0.5721 6.4338 3.4792 10.7994 5.2786 23.4414 46.4540 0.5802 3.4383 12.8987 38.5992 3.3886 5.3286 47.9740 5.2431 39.2750 0.2789 0.1376 24.2624 13.6313 125.1481 21.7764 6.0402 8.7720 25.2909 30.2928 13.2245 108.9085 45.1097 3.7217 29.0839 1.0008 22.3332 27.4256 21.1320 33.7684 58.8320 46.4512 3.9896 12.2784 76.1816 18.3028 14.5817 5.3021 13.2972 24.8458 107.3291 46.3942 2.8224 637.7424 392.2900 42.8193 17.8361 67.6252 34.6225 26.8468 8.6979 16.3308 11.3269 15.9338 30.5046 17.4917 16.4056 0.7515 0.4137 18.4727 12.2243 94.9220
temp: 298.150 k
press: 1.00000 atm
elementType: 17 17 8 8 7 7 7 7 7 6 6 6 6 6 6 6 6 6 6 6 6 1 1 1 1 1 1 1 1 1 1 1 1 1 1 1 1 1
symmnumber: 1
zpe: 773180.5 jmol-1
zpe.correction: 0.294489 hartree
zpe.thermalcorrener: 0.316625 hartree
zpe.thermalcorrenthalpy: 0.317569 hartree
zpe.thermalcorrgfe: 0.238247 hartree
zpe.sumelectzpe: -1810.244994 hartree
zpe.sumelectthermal: -1810.222858 hartree
zpe.sumelectthermalent: -1810.221914 hartree
zpe.sumelectthermalfe: -1810.301236 hartree
dipole: 2.1502 0.2237 2.8129
dipole: 3.5477
quadrupole: -162.2383 -150.9974 -139.4775
quadrupole: 3.0736 3.1769 0.8045
quadrupole: -11.3339 -0.0930 11.4269 3.0736 3.1769 0.8045
hfenergy: -1810.5394826 hartree
pointgroup: C01 [X(C12H17Cl2N5O2)]
dipole: 0.9460779 -1.0246701 -0.0560895 debye
polarizability: 241.6301846|-12.5169437|159.4471284|-34.934031|-15.7951923|184.3943251 unknown
InChI: InChI=1S/C12H17Cl2N5O2/c1-17-10-9(11(20)18(2)12(17)21)15-8(16-10)7-19(5-3-13)6-4-14/h15H,3-7H2,1-2H3
charge 0 multiplicity 1
38 atoms
Cl 4.924104 0.011076 -4.418438
Cl 3.86948 2.589045 2.140057
O  -2.225885 1.975447 -1.300712
O  -4.621506 -0.294593 2.07893
N  2.985559 -0.258959 -0.762004
N  0.129572 0.091535 -0.549039
N  -2.401053 -0.958302 1.705579
N  -0.040999 -1.455881 1.10937
N  -3.413858 0.816151 0.404034
C  2.177049 -1.343618 -0.150484
C  0.771193 -0.901947 0.165525
C  -1.168932 0.200197 -0.045046
C  -1.243746 -0.768743 0.967943
C  3.816446 -0.646845 -1.934096
C  3.727399 0.566644 0.230562
C  -2.249921 1.079299 -0.40222
C  -3.541779 -0.158739 1.437789
C  3.8011 0.482944 -2.974595
C  2.809008 1.547475 0.974471
C  -2.460513 -1.985905 2.763261
C  -4.62311 1.634801 0.153901
H  2.629632 -1.738394 0.785157
H  2.127345 -2.195557 -0.855371
H  0.559683 0.660133 -1.279549
H  3.394452 -1.555838 -2.396705
H  4.866408 -0.879283 -1.651419
H  4.495783 1.15207 -0.303772
H  4.258409 -0.072145 0.973225
H  2.799448 0.634805 -3.402225
H  4.203257 1.430376 -2.585404
H  2.319562 2.256012 0.290524
H  2.069004 1.05419 1.620721
H  -3.473587 -1.964791 3.190051
H  -1.713888 -1.769412 3.545663
H  -2.246897 -2.980066 2.336464
H  -4.38504 2.326462 -0.667348
H  -4.896832 2.194266 1.06329
H  -5.469645 0.984191 -0.119186
