program: Gaussian 09
title: 000247987
version: EM64L-G09RevD.01
frameworkgroup: C1[X(C6H3Cl2NO2)]
method: RPBEPBE
basis: SDD
operation: Freq
keyword: #p
keyword: freq=noraman
keyword: PBEPBE/SDD
title: #p freq=noraman PBEPBE/SDD
converged: NO NO NO YES
title: Mulliken charges:
elementType: Cl Cl O O N C C C C C C H H H
charge: 0.014107 0.041996 -0.428390 -0.236391 0.083721 0.274355 -0.182060 -0.004439 -0.409799 -0.287334 0.135866 0.307680 0.296199 0.394490
chargesum: 0.00000
title: Mulliken charges with hydrogens summed into heavy atoms:
elementType: Cl Cl O O N C C C C C C
charge: 0.014107 0.041996 -0.033901 -0.236391 0.083721 0.274355 0.125620 -0.004439 -0.113600 -0.287334 0.135866
polarizability: 1.56593917e+02 1.79610191e+00 1.03039338e+02 -7.42488658e-04 2.69354417e-03 3.58842093e+01
1716.lowfreq: -4.1308 -0.0030 -0.0009 -0.0007 4.2069 12.4852 60.6855 75.8480 147.0309
frequency: 60.6333 75.8444 147.0293 155.2548 184.2468 284.5928 296.2632 316.1387 418.7217 450.7111 493.3984 504.4756 511.5319 609.9725 627.7264 641.3920 709.4962 745.4603 829.7574 943.2893 945.1920 997.9515 1042.3294 1129.1596 1142.5530 1217.1187 1325.9575 1330.7953 1354.2949 1415.3813 1521.0870 1569.9746 1643.2944 3172.3198 3182.1390 3530.9643
redmass: 14.9644 8.4676 10.5106 6.0454 27.5509 7.2734 13.6822 12.1166 12.8839 4.5390 9.6247 3.3223 6.0145 1.3111 6.0163 7.0554 8.8536 4.1760 10.1749 1.5172 1.3834 6.5490 3.2054 5.2288 1.5745 1.8700 2.5239 5.3659 2.9444 3.2902 8.8113 6.4464 9.1944 1.0937 1.0937 1.0644
irintensity: 1.4185 0.1319 1.2666 0.1550 0.1670 0.2348 0.3490 0.0056 3.3786 1.9053 62.4858 26.8662 32.8331 127.6573 4.8902 19.8539 12.1817 35.5153 50.9345 25.1787 2.2939 49.5744 221.8201 195.3698 54.4141 4.6120 101.4262 72.9121 125.3160 52.1578 0.6312 73.6161 279.6123 5.3248 0.5969 63.2774
temp: 298.150 k
press: 1.00000 atm
elementType: 17 17 8 8 7 6 6 6 6 6 6 1 1 1
symmnumber: 1
zpe: 212495.3 jmol-1
zpe.correction: 0.080935 hartree
zpe.thermalcorrener: 0.090695 hartree
zpe.thermalcorrenthalpy: 0.091639 hartree
zpe.thermalcorrgfe: 0.044273 hartree
zpe.sumelectzpe: -1354.971083 hartree
zpe.sumelectthermal: -1354.961323 hartree
zpe.sumelectthermalent: -1354.960379 hartree
zpe.sumelectthermalfe: -1355.007745 hartree
dipole: -2.5877 -0.0554 0.0002
dipole: 2.5883
quadrupole: -69.7244 -82.1358 -76.0803
quadrupole: 8.4603 0.0034 0.0010
quadrupole: 6.2558 -6.1556 -0.1002 8.4603 0.0034 0.0010
hfenergy: -1355.0520183 hartree
pointgroup: C01 [X(C6H3Cl2N1O2)]
dipole: -1.0152834 0.0784414 -0.0000685 debye
dipolederiv: -0.312821 0.3370865 -0.000013 0.3864947 -0.5367632 0.000025 -0.0000245 0.0000538 -0.0148486 -0.9199709 -0.1451868 -0.0001167 -0.1875214 -0.076718 -0.0000281 -0.0002423 -0.000049 -0.0384114 -0.8907859 0.4947185 0.0000984 0.6068325 -0.8251017 -0.0001468 0.0005533 -0.0006329 -0.422753 -0.91195 -0.2536003 -0.0001084 -0.2192578 -0.8573293 -0.0004262 0.0003757 0.000367 -0.3230562 -0.8146301 -0.0829659 -0.0000813 0.4537426 -0.4275892 0.0000769 0.0000234 -0.000041 -0.1703483 -0.7446384 -0.1012356 0.0000942 -0.0178083 -0.1271738 0.0000048 -0.000187 -0.0000376 0.0339887 0.1568537 0.2443072 0.0000148 -0.1208533 -0.081548 0.0000065 -0.0001553 0.000021 -0.0324751 0.0242741 -0.7294713 -0.0000087 -0.8946313 0.6681913 -0.0000774 0.0000288 -0.0000961 -0.0173245 0.3714801 0.0213547 0.0000422 -0.0149107 0.2632116 0.0000035 -0.0001204 -0.0000349 -0.0280589 1.5387901 0.3719541 0.0002287 0.2330249 0.2264666 0.0000136 0.000277 0.0001109 0.0438192 2.0547129 -0.059751 -0.0002221 -0.1217066 1.3601717 0.0005453 -0.0006349 0.0003133 0.2505851 0.1336025 -0.0377293 -0.000011 -0.0005487 0.0735663 -0.000006 0.0000035 -0.0000074 0.1614631 0.066756 0.0376724 -0.0000124 0.0668325 0.0700078 0.0000019 -0.0000112 0.0000283 0.1471931 0.2483269 -0.0971531 0.0000952 -0.1696892 0.2706077 0.0000069 0.0001139 0.0000045 0.4102267 unknown
polarizability: 156.2280865|-4.7627793|103.4051691|0.0008913|0.002648|35.8842093 unknown
InChI: InChI=1S/C6H3Cl2NO2/c7-4-1-3(6(10)11)2-9-5(4)8/h1-2,10H
charge 0 multiplicity 1
14 atoms
Cl 2.451918 -2.20579 0.00008
Cl 3.55298 0.905945 0.00037
O  -3.155847 1.006705 0.000678
O  -2.947479 -1.313145 0.000291
N  0.948729 1.597959 -0.000006
C  -0.947932 0.079809 -0.000274
C  -0.064036 -1.029145 -0.000206
C  1.321664 -0.798665 -0.000071
C  -0.394508 1.38446 -0.000107
C  1.781178 0.544562 -0.000032
C  -2.413221 -0.179516 -0.000532
H  -0.469255 -2.045408 -0.000292
H  -1.035657 2.269218 -0.000176
H  -4.126332 0.787314 0.001377
