program: Gaussian 09
title: 000247984
version: EM64L-G09RevD.01
frameworkgroup: C1[X(C7H13NO)]
method: RPBEPBE
basis: SDD
operation: Freq
keyword: #p
keyword: freq=noraman
keyword: PBEPBE/SDD
title: #p freq=noraman PBEPBE/SDD
converged: YES YES NO NO
title: Mulliken charges:
elementType: O N C C C C C C C H H H H H H H H H H H H H
charge: -0.257558 -0.391475 0.347796 -0.493428 -0.170216 0.125053 -0.702218 -0.726811 -0.719681 0.220826 0.221608 0.247462 0.305703 0.214177 0.212942 0.229476 0.211950 0.231585 0.219175 0.210601 0.213570 0.249461
chargesum: 0.00000
title: Mulliken charges with hydrogens summed into heavy atoms:
elementType: O N C C C C C C C
charge: -0.257558 -0.085772 0.347796 -0.050993 0.077246 0.125053 -0.045622 -0.064101 -0.046049
polarizability: 1.00370842e+02 1.88009677e+00 7.91638408e+01 8.57287137e-01 -1.25267371e+00 6.86509515e+01
1716.lowfreq: -15.9508 -0.0007 -0.0004 -0.0003 4.2862 12.1304 85.8785 104.5954 198.2616
frequency: 85.8059 104.5888 198.2565 216.9358 235.1499 248.0657 297.0683 307.5674 329.3048 383.1347 454.8806 498.8095 544.7735 582.5781 593.8743 681.6477 763.7150 803.4827 896.2929 905.1356 923.5357 948.3249 959.9458 993.4006 1036.1951 1075.5329 1124.5132 1152.8774 1191.1701 1214.1266 1240.9445 1262.2503 1281.4049 1296.6211 1327.9552 1368.1872 1377.2545 1389.5002 1396.2061 1459.2623 1461.8145 1468.8262 1475.5060 1479.7704 1480.6728 1482.1937 1658.9425 2973.4525 2974.5188 2978.1837 2983.2701 3000.9886 3066.3564 3072.0210 3076.3776 3079.1082 3081.2498 3087.3953 3091.9556 3552.5199
redmass: 2.6183 4.6471 1.0622 1.0474 2.1028 1.3099 2.2351 2.4350 2.4704 2.2458 2.7501 2.8190 3.3608 1.5256 3.3961 4.0510 3.3343 3.1450 1.7982 1.7154 1.4131 1.9239 1.7576 1.2693 1.5052 1.6470 2.0299 2.0268 2.3519 2.9309 2.0644 1.6774 1.4429 1.8674 2.1405 1.9157 1.2383 1.2072 1.2262 1.0567 1.0553 1.0561 1.0647 1.0532 1.0701 1.0589 8.7562 1.0675 1.0481 1.0371 1.0357 1.0621 1.1004 1.1012 1.0994 1.1003 1.1004 1.0999 1.0995 1.0782
irintensity: 0.2987 1.1594 0.6635 0.0028 3.1274 1.7691 0.8147 2.4255 0.6478 2.5802 0.1798 7.2385 2.6878 86.3213 25.4362 27.8674 7.6535 0.1998 1.0731 1.9201 1.3564 3.1577 3.8669 2.3110 2.9782 2.2912 8.6248 6.4673 4.8248 34.6290 73.8203 18.7151 5.7229 37.7529 16.3942 57.6049 28.2971 22.5025 5.5541 2.1298 3.5880 7.0692 19.0182 6.7937 5.8108 8.9263 385.6897 0.3487 31.7998 29.2739 28.3329 31.0616 3.5048 16.0765 37.8469 33.8736 47.8220 53.3950 17.1991 15.9303
temp: 298.150 k
press: 1.00000 atm
elementType: 8 7 6 6 6 6 6 6 6 1 1 1 1 1 1 1 1 1 1 1 1 1
symmnumber: 1
zpe: 500490.0 jmol-1
zpe.correction: 0.190627 hartree
zpe.thermalcorrener: 0.200438 hartree
zpe.thermalcorrenthalpy: 0.201382 hartree
zpe.thermalcorrgfe: 0.156501 hartree
zpe.sumelectzpe: -403.822716 hartree
zpe.sumelectthermal: -403.812904 hartree
zpe.sumelectthermalent: -403.811960 hartree
zpe.sumelectthermalfe: -403.856841 hartree
dipole: -3.8601 -2.4795 0.2452
dipole: 4.5944
quadrupole: -59.7056 -58.1333 -54.8045
quadrupole: -8.4542 1.0309 -0.6086
quadrupole: -2.1578 -0.5855 2.7433 -8.4542 1.0309 -0.6086
hfenergy: -404.0133421 hartree
pointgroup: C01 [X(C7H13N1O1)]
dipole: 1.6364174 0.7097895 0.2927415 debye
dipolederiv: -1.1266892 -0.2410739 -0.0462643 -0.4221316 -0.6745662 -0.1339969 -0.1610389 -0.1710985 -0.4336464 -1.2337914 -0.1151841 0.001665 0.0814015 -0.3676926 0.0710059 0.2601164 0.094067 -0.5262522 0.5458825 0.0981436 0.0826924 0.2770018 0.315068 -0.0555208 0.1804862 -0.0590682 0.397572 -0.0901462 0.074921 0.0933839 0.0365038 0.0273443 0.0022856 0.0395394 -0.0319786 0.082683 0.0464241 -0.0280235 -0.0080006 0.0065642 -0.1423803 -0.2132266 -0.0027767 -0.2125506 0.0208088 1.7516439 0.2989983 -0.0601993 0.1495192 0.6385777 0.3202423 -0.2058668 0.3594906 0.3847762 -0.0482165 0.005453 -0.0420392 -0.001026 0.0036549 0.0956033 -0.0792436 0.0591245 -0.0854269 -0.0499759 -0.0410764 0.0288725 -0.0523124 0.0411909 0.035685 0.0505421 0.0624524 -0.0514553 -0.0280177 -0.0042326 -0.0213489 -0.0015315 0.061161 0.0175937 0.0070951 0.0004581 0.0923209 0.0495134 0.0324924 -0.028156 0.0082417 -0.0461077 0.0908281 -0.0090701 0.1376278 -0.0478799 0.0061108 -0.0734062 -0.07099 -0.0549751 0.0255574 -0.0700986 -0.0854954 -0.0995819 -0.0554863 0.0451968 0.0013885 -0.0181602 0.0010775 0.0072749 0.0787647 0.0042729 0.0716531 -0.0989226 0.1109693 0.0175353 0.0330213 -0.0080482 0.1627354 -0.1103062 0.0057818 -0.101644 0.2789578 0.0284938 0.1032854 0.0087273 0.1219226 -0.0862969 -0.0421912 0.0494571 -0.0903347 0.0440756 -0.0647036 -0.0840208 -0.0758891 -0.1248203 -0.0164471 -0.0628397 -0.0957979 -0.0321958 0.0556548 -0.0006585 -0.0473686 0.127634 -0.0307536 0.0754346 0.0437346 0.0932999 0.053596 -0.0584965 0.0005062 0.0827651 0.0645542 0.1349875 -0.0795461 -0.0838665 0.0692771 -0.0371969 0.0527057 0.0309721 0.0562821 -0.1062111 0.0451814 0.05029 0.0847798 -0.0618726 0.0772862 -0.0627443 -0.0365177 -0.0978679 -0.0236654 -0.1364236 -0.0159744 -0.0400203 -0.0608789 -0.0797532 0.0481011 0.0808 0.0050206 -0.0204814 0.0526089 -0.0775556 -0.1239609 0.0089524 -0.1365579 -0.0276729 0.0709379 -0.005755 0.0466719 0.0262209 0.0357184 0.0689168 -0.0122525 0.1143072 -0.1131239 -0.0887341 -0.0382763 0.0341828 -0.1092088 0.0625596 0.026588 0.005473 0.0218974 0.1034512 unknown
polarizability: 100.3421625|0.0275018|76.719337|-2.4633041|4.5091295|71.1241347 unknown
InChI: InChI=1S/C7H13NO/c1-5-4-7(2,3)8-6(5)9/h5,8H,4H2,1-3H3
charge 0 multiplicity 1
22 atoms
O  -2.063705 -1.289125 -0.622425
N  0.256112 -0.875259 -0.776704
C  1.309078 0.031741 -0.244374
C  0.433359 1.225876 0.26896
C  -0.961584 0.62396 0.585228
C  -1.033003 -0.620122 -0.332727
C  2.080143 -0.653416 0.915329
C  2.283637 0.45715 -1.363696
C  -2.159941 1.567717 0.381724
H  0.331266 1.976645 -0.53731
H  0.898334 1.721001 1.138685
H  -0.985385 0.242285 1.627378
H  0.469754 -1.697298 -1.344786
H  2.584389 -1.572766 0.563837
H  2.852207 0.024898 1.322904
H  1.393554 -0.932534 1.734662
H  2.878501 -0.401881 -1.728288
H  1.731486 0.886862 -2.218245
H  2.991073 1.218578 -0.98756
H  -2.150239 2.391045 1.118796
H  -2.144468 2.009338 -0.631726
H  -3.10427 1.006203 0.48954
