program: Gaussian 09
title: 000247971
version: EM64L-G09RevD.01
frameworkgroup: C1[X(C7H7N3O3)]
method: RPBEPBE
basis: SDD
operation: Freq
keyword: #pfreq=noraman
keyword: PBEPBE/SDD
title: #p freq=noraman PBEPBE/SDD
converged: YES YES NO NO
title: Mulliken charges:
elementType: O O O N N N C C C C C C C H H H H H H H
charge: -0.433070 -0.282456 -0.193874 -0.148202 -0.408452 -0.000194 -0.356960 -0.196875 -0.305575 0.272770 0.189056 0.112563 -0.193924 0.279728 0.200944 0.281506 0.231739 0.197622 0.377804 0.375850
chargesum: 0.00000
title: Mulliken charges with hydrogens summed into heavy atoms:
elementType: O O O N N N C C C C C C C
charge: -0.057220 -0.282456 -0.193874 -0.148202 -0.030648 -0.000194 0.123713 0.084631 0.123787 0.272770 0.189056 0.112563 -0.193924
polarizability: 1.68326232e+02 8.05690935e+00 1.02997354e+02 -7.17877197e+00 1.08209595e+00 5.28658828e+01
1716.lowfreq: -0.0009 -0.0006 -0.0004 3.6960 7.2504 9.6244 50.1225 71.2223 121.6360
frequency: 50.1071 71.2018 121.6342 124.8262 170.2822 175.3019 227.1109 258.4675 326.5858 355.4376 402.2046 409.9445 454.0208 463.1493 503.2670 519.1005 626.6996 646.8662 667.9109 707.5727 731.8350 752.3941 775.9930 794.1086 884.4020 922.6983 942.8304 1036.6949 1049.6497 1095.6964 1119.9814 1195.8654 1221.7654 1233.9758 1319.1196 1337.5163 1346.6574 1359.4410 1371.1611 1408.3686 1418.0127 1451.7025 1466.5284 1604.7246 1643.7436 1661.1448 2190.6094 2945.5813 3022.3928 3067.1964 3092.2091 3178.8600 3424.7387 3515.8672
redmass: 5.7429 8.2238 10.3412 3.9547 4.1116 7.2216 6.1566 5.4667 4.0517 12.3893 3.8963 4.3169 9.1628 3.1231 5.6446 8.2421 1.2490 5.6607 3.2883 2.8112 4.3496 7.8355 3.4785 2.1519 3.2075 1.4324 1.9831 3.6375 2.5902 3.9093 5.0377 1.1610 5.4550 1.3058 2.1563 2.0574 1.2670 1.4010 1.7135 2.9197 1.2899 1.1132 1.0956 5.5288 10.7981 5.8195 12.6164 1.0700 1.0599 1.0944 1.1040 1.0945 1.0654 1.0771
irintensity: 7.8359 0.1136 3.9155 2.4601 12.5091 2.4165 0.4362 2.7932 9.1930 11.6881 14.9325 9.4855 3.9541 7.9828 7.0655 0.8425 131.2377 19.3577 29.8604 2.1608 12.3805 3.2463 2.4234 136.4109 7.2860 18.2873 41.2220 108.3161 19.5071 7.0073 43.8338 58.8600 11.7939 15.9818 82.2865 72.6338 43.7878 9.3032 16.0833 217.9733 68.8453 16.8685 8.7700 4.9052 244.4897 825.1958 29.1425 58.1227 13.3525 34.1313 11.8520 0.9084 154.7462 74.1678
temp: 298.150 k
press: 1.00000 atm
elementType: 8 8 8 7 7 7 6 6 6 6 6 6 6 1 1 1 1 1 1 1
symmnumber: 1
zpe: 376017.1 jmol-1
zpe.correction: 0.143217 hartree
zpe.thermalcorrener: 0.154825 hartree
zpe.thermalcorrenthalpy: 0.155770 hartree
zpe.thermalcorrgfe: 0.105052 hartree
zpe.sumelectzpe: -659.926202 hartree
zpe.sumelectthermal: -659.914594 hartree
zpe.sumelectthermalent: -659.913650 hartree
zpe.sumelectthermalfe: -659.964368 hartree
dipole: 3.1275 -2.1343 -1.0726
dipole: 3.9354
quadrupole: -120.0438 -71.1351 -73.6681
quadrupole: -8.0461 0.2252 1.1981
quadrupole: -31.7615 17.1473 14.6142 -8.0461 0.2252 1.1981
hfenergy: -660.0694198 hartree
pointgroup: C01 [X(C7H7N3O3)]
dipole: 1.2316404 0.8056671 0.4808353 debye
dipolederiv: -0.6737466 0.133122 0.0759474 0.1536709 -0.5523683 -0.0005943 0.1218095 0.0141156 -0.6075067 -1.4336203 0.2173273 0.1314961 0.3938969 -0.6904684 -0.0703065 0.1918021 -0.0521409 -0.3965904 -0.8806309 -0.341333 -0.0846845 -0.4328724 -0.750671 -0.1113889 -0.1314959 -0.1228471 -0.3667134 -1.3098783 -0.0564842 0.0522505 0.8310528 -0.7763878 -0.1737847 0.3277757 -0.161197 -0.2420162 -1.2872078 -0.1779102 -0.0179495 -0.0381736 -0.395166 -0.007586 -0.0130263 -0.0115961 -0.3461885 -0.3332837 0.0711946 0.0254881 0.1059195 -0.2466562 -0.0080895 0.0293837 -0.0040909 -0.2306803 0.4356496 0.2334574 0.075609 0.3205768 0.2896477 0.0309218 0.2144182 0.033363 0.104151 1.4347556 0.1120349 0.0137222 -0.2398156 0.1176035 0.0400482 -0.0597722 0.0344405 0.0170605 0.4557801 -0.1474698 -0.0178691 -0.2427987 0.4156643 -0.0282525 -0.139029 -0.0034495 0.3578901 1.693616 -0.1176803 -0.0880846 -0.6597571 1.2971727 0.2835659 -0.2445716 0.2631728 0.4188729 -0.5559607 -0.0423879 0.0058485 -0.4430242 -0.3900053 -0.1077206 -0.1565247 -0.1181755 -0.0178111 1.4030254 0.3150548 0.0792807 0.3569535 1.1667943 0.244276 0.1077655 0.2523078 0.3501013 0.3582019 -0.212858 -0.0641058 -0.1995503 0.0263323 -0.003167 -0.0543093 -0.0089769 0.0465263 -0.008053 -0.0365267 -0.0549528 -0.0128473 0.0411166 0.0910663 -0.0402126 0.0280027 0.0053517 -0.0044648 0.091686 0.0813782 0.0199976 -0.0566714 -0.0726686 0.0395818 -0.051991 0.0733842 0.1135323 -0.0302873 -0.0121904 0.0090776 0.016328 -0.0425332 0.0112905 -0.0411244 0.1477713 -0.0124504 -0.0955773 -0.0012039 -0.0711408 -0.1032297 -0.0128162 0.0184781 -0.045453 0.0815066 -0.0801708 0.0880769 -0.1334559 0.0600185 0.0380644 -0.0036519 -0.1067882 0.0325533 -0.1171862 0.1318486 -0.0035449 -0.0026419 0.0063959 0.2715562 -0.0239163 0.0106558 -0.0219902 0.3330321 0.5530578 0.0001058 -0.0638824 0.08242 0.281344 -0.0234021 -0.1272311 -0.014923 0.3890449 unknown
polarizability: 169.1461488|-4.3189408|99.5742758|-5.1932178|11.8046466|55.4690439 unknown
InChI: InChI=1S/C7H7N3O3/c8-3-5-4-10(1-2-11)7(13)9-6(5)12/h4,9,11H,1-2H2
charge 0 multiplicity 1
20 atoms
O  4.03923 0.385914 -0.653515
O  2.045469 -1.48264 -0.242265
O  -2.607704 -1.832444 -0.356173
N  0.792915 0.424532 0.337162
N  -0.28488 -1.598311 -0.264801
N  -3.947798 1.550458 0.577046
C  2.0421 1.1968 0.631492
C  -0.45313 1.00605 0.48509
C  2.991016 1.387379 -0.584522
C  0.922347 -0.930054 -0.069372
C  -1.643998 0.32928 0.268794
C  -1.618634 -1.092501 -0.134199
C  -2.899413 0.992862 0.436463
H  2.603137 0.67742 1.429549
H  1.707835 2.174158 1.019383
H  -0.458403 2.05485 0.791953
H  3.518988 2.349022 -0.466448
H  2.388393 1.438004 -1.518534
H  -0.204682 -2.579486 -0.554479
H  3.600713 -0.510796 -0.616422
