program: Gaussian 09
title: 000247965
version: EM64L-G09RevD.01
frameworkgroup: C1[X(C11H11NO2)]
method: RPBEPBE
basis: SDD
operation: Freq
keyword: #p
keyword: freq=noraman
keyword: PBEPBE/SDD
title: #p freq=noraman PBEPBE/SDD
converged: NO YES NO NO
title: Mulliken charges:
elementType: O O N C C C C C C C C C C C H H H H H H H H H H H
charge: -0.293504 -0.270478 -0.405343 0.164005 0.242948 0.125072 -0.326270 -0.385039 -0.353399 0.176651 -0.239740 -0.212028 -0.216392 -0.677314 0.312992 0.283763 0.280445 0.229518 0.224672 0.223739 0.225612 0.225614 0.210573 0.226952 0.226949
chargesum: 0.00000
title: Mulliken charges with hydrogens summed into heavy atoms:
elementType: O O N C C C C C C C C C C C
charge: -0.293504 -0.270478 -0.092351 0.164005 0.242948 0.125072 -0.042507 -0.104594 -0.123882 0.176651 -0.015068 0.011711 0.234835 -0.012839
polarizability: 2.00800742e+02 -5.08303621e+00 1.41024157e+02 -1.43212688e-02 -8.06792413e-03 6.21350357e+01
1716.lowfreq: -4.0182 -0.0010 -0.0005 0.0004 3.3446 8.5697 33.2074 70.0696 85.0170
frequency: 33.1739 70.0687 85.0124 95.8030 149.7863 186.2047 222.2643 250.4627 290.5454 301.2173 366.4421 397.6154 425.6875 497.9997 564.8399 574.3698 575.9933 611.7972 627.4205 713.7076 757.6604 759.8916 774.1229 776.3137 798.7463 829.7440 848.5607 864.9659 869.7697 946.2975 981.9502 986.7058 1010.2652 1035.1318 1090.7238 1110.9900 1121.9456 1136.6484 1149.2298 1168.4417 1244.6177 1247.2258 1250.9278 1290.7085 1345.7733 1363.0968 1394.1214 1400.1563 1425.5863 1454.3770 1463.8238 1474.9327 1485.5842 1488.0970 1525.7557 1589.6782 1625.8420 1636.9518 2992.9006 3005.3012 3061.6549 3089.4607 3103.2001 3127.7459 3139.8315 3158.6482 3177.2411 3245.4329 3601.1377
redmass: 3.0605 2.9013 4.1932 4.4622 3.2750 4.9482 4.0337 1.2514 5.3423 5.1278 3.9013 5.8541 2.9251 5.1857 1.7168 3.1521 6.2999 2.0785 6.8654 4.7430 1.3791 5.6183 7.1498 3.7503 1.1020 3.7542 1.4787 1.4453 4.9085 1.3697 4.5220 1.3058 2.0875 3.0635 1.9174 2.1725 1.6378 1.4664 1.8283 1.1793 1.6293 1.1335 2.6027 2.5429 1.6653 1.8117 3.1586 1.5158 2.4263 3.9604 1.0407 1.0558 2.2777 1.2405 5.5739 6.4601 10.6824 7.4047 1.0357 1.0581 1.1064 1.0985 1.1024 1.0857 1.0910 1.0969 1.0974 1.0990 1.0810
irintensity: 0.1986 3.0193 1.0786 1.2112 2.0283 4.7389 10.7218 0.7730 6.5824 0.2520 8.8636 1.0158 11.7163 2.4920 54.5721 4.7881 1.5004 48.7541 2.4479 1.6613 115.7565 1.6803 6.9757 15.1733 2.1936 5.1943 11.0641 0.5710 4.4010 4.3487 198.7558 0.5791 16.3105 187.3109 45.3645 11.2526 146.8334 5.2713 117.4867 17.2512 55.9782 0.0133 21.2041 55.5945 11.7065 10.4362 113.6805 1.0148 57.1171 24.9672 11.6017 7.0701 3.3084 7.0328 68.8034 13.2105 189.9377 92.8505 25.5258 24.8127 10.1897 34.0591 49.2478 0.1953 19.6971 26.2065 9.6669 1.6924 69.0689
temp: 298.150 k
press: 1.00000 atm
elementType: 8 8 7 6 6 6 6 6 6 6 6 6 6 6 1 1 1 1 1 1 1 1 1 1 1
symmnumber: 1
zpe: 517195.4 jmol-1
zpe.correction: 0.196989 hartree
zpe.thermalcorrener: 0.209332 hartree
zpe.thermalcorrenthalpy: 0.210276 hartree
zpe.thermalcorrgfe: 0.157465 hartree
zpe.sumelectzpe: -629.988686 hartree
zpe.sumelectthermal: -629.976343 hartree
zpe.sumelectthermalent: -629.975399 hartree
zpe.sumelectthermalfe: -630.028210 hartree
dipole: 0.2172 4.1906 -0.0005
dipole: 4.1962
quadrupole: -64.7445 -71.9781 -85.5413
quadrupole: 2.7262 -0.0024 -0.0028
quadrupole: 9.3435 2.1098 -11.4533 2.7262 -0.0024 -0.0028
hfenergy: -630.1856751 hartree
pointgroup: C01 [X(C11H11N1O2)]
dipole: 0.0786887 -1.6490442 0.0002014 debye
dipolederiv: -2.0551327 -0.0762618 -0.0001803 -0.3994415 -0.4615516 -0.0000538 -0.0001014 0.0000057 -0.2891404 -0.7779575 0.1138834 -0.000059 0.1081069 -0.9803971 0.0000766 -0.0000759 0.0000017 -0.3280494 -0.8048423 0.4136248 -0.0001021 0.010197 -0.4951235 0.0000234 -0.0000626 0.0000693 -0.2644174 0.38921 0.1278023 0.0000243 0.1168292 -0.1756077 0.0000367 0.0000366 0.0000398 0.0142431 0.0862037 0.1024235 -0.0000081 0.5541616 0.2007629 0.0000359 -0.0000737 -0.0000102 0.0286114 -0.6927515 0.207766 -0.0000813 0.6373318 -0.4783479 0.0001007 -0.0001578 0.0000669 -0.0943739 0.3466816 -0.5413844 0.0001171 -0.7076329 0.4161329 -0.000141 0.000114 -0.000107 -0.0925626 -0.041774 -0.0148114 0.0000143 -0.0534972 0.0758077 -0.0000324 0.0000151 -0.0000221 -0.1397786 0.0516863 -0.0414908 0.0000333 -0.058533 0.019433 -0.0000328 0.000036 -0.0000319 -0.1881127 2.443531 -0.2460405 0.000275 -0.0071107 1.2519798 -0.00007 0.0002751 -0.0000733 0.2414929 -0.0813879 0.0184041 0.0000088 0.0508941 0.1218576 -0.0000309 0.0000074 -0.0000356 -0.17723 0.0377603 -0.0191522 0.000028 -0.0751513 -0.0438897 -0.0000252 0.0000316 -0.0000194 -0.174552 1.0626561 -0.0499449 0.0000571 -0.2307555 0.2592387 -0.0000103 0.0000612 0.0000041 0.3594911 -0.1192561 -0.0799781 -0.000022 -0.045802 0.007062 -0.0000121 -0.0000214 -0.0000162 0.0665235 0.1459636 0.0161928 -0.0000246 -0.0308832 0.2325174 0.0000125 -0.0000139 0.0000198 0.3383922 0.0814854 -0.0445831 -0.0000069 -0.0652154 0.0674076 0.0000097 -0.0000043 0.0000075 0.1930607 0.0901211 0.0797051 -0.0000186 0.0408968 0.0277169 0.0000215 -0.0000172 0.000022 0.1604146 0.0189807 0.0686481 -0.0000271 0.1133904 -0.0620576 0.0000438 -0.0000316 0.0000396 0.1771742 0.0289001 -0.0877115 -0.0000039 -0.101246 -0.0891633 0.0000201 -0.000002 0.0000212 0.1619904 -0.1462757 -0.0186675 -0.0000334 -0.0230526 0.0882629 0.000007 -0.0000329 0.0000073 0.1629336 -0.0668162 -0.0193621 -0.0236751 0.0787482 -0.0093764 -0.0926284 0.0213482 -0.102618 -0.0662302 -0.0667965 -0.0193797 0.0236718 0.078737 -0.0093884 0.0926432 -0.0213442 0.1026115 -0.0662012 -0.161544 0.0803868 -0.0000248 0.1074298 0.0307735 0.0000101 -0.0000209 0.0000079 0.1134877 0.1156785 0.0149768 0.0277945 -0.049188 0.0029817 -0.1088204 -0.0046803 -0.1160124 -0.0685865 0.115676 0.0149542 -0.0277569 -0.0492136 0.0029684 0.1088159 0.0047148 0.1160219 -0.0685804 unknown
polarizability: 200.8414721|4.8374485|140.9834274|0.014288|-0.0081267|62.1350357 unknown
InChI: InChI=1S/C11H11NO2/c1-2-14-11(13)9-7-12-10-6-4-3-5-8(9)10/h3-7,12H,2H2,1H3
charge 0 multiplicity 1
25 atoms
O  -2.723884 -0.229895 -0.000774
O  -1.56528 1.804762 -0.000686
N  1.021961 -2.108023 -0.000082
C  1.031695 0.180531 -0.000378
C  1.871648 -0.98452 -0.000129
C  -0.34628 -0.291991 -0.00049
C  -0.303745 -1.693441 -0.000297
C  1.629001 1.466981 -0.000469
C  3.280461 -0.906955 0.000026
C  -1.544855 0.545146 -0.000735
C  3.035304 1.552312 -0.000314
C  3.851557 0.382422 -0.000071
C  -3.996735 0.545362 -0.000833
C  -5.134268 -0.472056 -0.000969
H  1.33255 -3.077842 0.000093
H  -1.132813 -2.396916 -0.000308
H  0.996574 2.359104 -0.000645
H  3.910056 -1.803733 0.000215
H  3.517412 2.536152 -0.000381
H  4.942145 0.48776 0.000043
H  -4.013375 1.196121 0.892715
H  -4.013242 1.196217 -0.894311
H  -6.106978 0.053139 -0.001058
H  -5.087311 -1.115794 -0.896345
H  -5.087499 -1.115842 0.894383
