program: Gaussian 09
title: 000247966
version: EM64L-G09RevD.01
frameworkgroup: C1[X(C10H10N2O2)]
method: RPBEPBE
basis: SDD
operation: Freq
keyword: #p
keyword: freq=noraman
keyword: PBEPBE/SDD
title: #p freq=noraman PBEPBE/SDD
converged: YES YES NO NO
title: Mulliken charges:
elementType: O O N N C C C C C C C C C C H H H H H H H H H H
charge: -0.215432 -0.206666 -0.408099 0.148035 0.382358 0.116919 -0.560762 0.235637 -0.417146 -0.367852 -0.402451 -0.347208 -0.254694 -0.213058 0.229527 0.255106 0.272393 0.309908 0.265601 0.260232 0.238022 0.230012 0.224747 0.224868
chargesum: 0.00000
title: Mulliken charges with hydrogens summed into heavy atoms:
elementType: O O N N C C C C C C C C C C
charge: -0.215432 -0.206666 -0.098191 0.148035 0.382358 0.116919 -0.076128 0.235637 -0.144753 0.157981 -0.164429 -0.117195 -0.029947 0.011810
polarizability: 1.82996098e+02 1.04562399e+01 1.45567461e+02 8.00667370e+00 -5.94098109e+00 7.09600758e+01
1716.lowfreq: -12.7024 -8.1268 -0.0003 0.0003 0.0005 5.2496 28.7139 36.1562 61.7303
frequency: 28.4894 36.1508 61.4911 68.5762 182.8101 196.4213 219.0757 233.4276 359.7399 424.2066 440.8223 456.2723 519.4236 530.3699 567.0951 576.2032 583.6734 634.0611 660.4167 744.3397 751.2395 752.5200 769.7036 791.5929 807.5266 853.3568 859.4739 868.5115 935.7721 975.7094 1007.5394 1012.9962 1020.9493 1074.6739 1098.0838 1133.7577 1155.6702 1171.6944 1225.5759 1236.7666 1244.1987 1267.8414 1277.0793 1299.0425 1336.3376 1351.9370 1390.9162 1419.7922 1422.2464 1447.9419 1458.7388 1476.3606 1483.1548 1563.4615 1588.3921 1632.4788 3002.2751 3044.4241 3062.9502 3124.3531 3131.6533 3133.8851 3146.1801 3164.6685 3220.9840 3611.7323
redmass: 12.4974 6.3322 2.7974 5.2082 4.3550 5.8823 3.9740 3.2090 6.2150 2.8686 3.5251 3.4230 1.3031 5.0444 5.4211 3.0591 5.1621 3.3624 7.5646 3.6359 3.6102 1.4272 4.1422 1.3408 1.5440 1.6611 4.2335 5.2551 1.3766 1.3008 1.8440 2.1947 5.1628 3.2716 1.5554 1.4170 1.2647 1.1120 5.2119 1.8186 1.6726 1.4082 1.3819 1.9675 1.5672 1.7903 5.2434 4.1986 2.4660 1.1500 3.7829 1.0994 3.0271 6.1288 6.1844 6.8798 1.0593 1.0596 1.1020 1.0858 1.0890 1.1067 1.0950 1.1001 1.0986 1.0810
irintensity: 0.3418 2.2145 2.8015 0.2306 7.2273 2.5634 7.4783 0.9895 1.8373 12.3742 0.9883 5.7282 93.6639 4.5914 2.0336 10.1818 33.3475 2.8885 1.2117 0.7523 20.1215 103.2407 7.1833 4.2761 14.9494 4.7706 12.7237 5.1690 2.6727 0.0386 3.1219 10.9443 6.1671 3.0521 47.2517 4.7503 16.2694 2.4385 177.6635 3.4370 20.4998 8.8998 2.9634 4.2532 2.9891 26.9823 34.0346 143.9176 6.5577 8.4523 25.0986 16.8887 1.8540 19.3324 0.9623 2.4883 15.8301 6.2388 8.6184 3.2586 3.2784 3.0126 31.1618 26.2477 0.3440 69.9731
temp: 298.150 k
press: 1.00000 atm
elementType: 8 8 7 7 6 6 6 6 6 6 6 6 6 6 1 1 1 1 1 1 1 1 1 1
symmnumber: 1
zpe: 486456.7 jmol-1
zpe.correction: 0.185282 hartree
zpe.thermalcorrener: 0.197210 hartree
zpe.thermalcorrenthalpy: 0.198155 hartree
zpe.thermalcorrgfe: 0.144937 hartree
zpe.sumelectzpe: -645.937674 hartree
zpe.sumelectthermal: -645.925745 hartree
zpe.sumelectthermalent: -645.924800 hartree
zpe.sumelectthermalfe: -645.978018 hartree
dipole: -5.2425 3.1777 -0.7414
dipole: 6.1751
quadrupole: -96.8245 -68.7664 -85.5636
quadrupole: -1.3896 2.5468 1.5411
quadrupole: -13.1064 14.9518 -1.8454 -1.3896 2.5468 1.5411
hfenergy: -646.1229551 hartree
pointgroup: C01 [X(C10H10N2O2)]
dipole: 2.0029944 -1.3485541 -0.2676951 debye
dipolederiv: -0.5540921 0.0991135 0.0446138 0.0302197 -0.5396291 -0.2746414 0.1032841 -0.3010161 -0.4589398 -0.9275102 -0.1039387 -0.2452578 -0.2202141 -0.369817 -0.2123899 -0.0728426 -0.1951444 -0.4131683 -0.7373811 0.3161104 0.0261944 -0.1318524 -0.4989871 0.0100425 0.1085847 -0.0878988 -0.2793036 1.4410648 -0.0484182 0.1625692 0.1443495 0.6443383 0.5469247 -0.2197023 0.5935181 0.5486104 -0.0389132 -0.0140211 -0.0414402 0.2405767 -0.1807859 0.0120074 -0.0254936 0.0308529 -0.1473302 0.0958493 0.3360353 0.0032392 0.0939116 -0.0922422 -0.0047861 -0.0301851 -0.0687942 -0.0036605 0.4010296 -0.0504192 0.0302084 -0.1127095 0.1448279 -0.0357862 0.2306595 -0.0841902 0.1194208 -0.166677 -0.0585478 0.0382925 0.361414 0.465863 -0.021988 0.0454443 0.0195973 0.0222443 0.5062882 -0.4258583 -0.1128415 -0.3929299 0.0491767 0.04031 -0.189675 0.1048822 -0.1407054 -0.3075405 0.1038366 0.0071193 0.1443849 0.1260437 -0.0396798 -0.07081 0.0028618 0.1232757 0.0037936 -0.0128256 -0.0516198 -0.0072729 0.0831776 -0.0077365 -0.0700522 0.0192079 -0.1483641 0.0714034 -0.0200842 -0.0648162 -0.0238694 0.0078929 -0.0029249 -0.0529522 0.0089111 -0.1679356 -0.0947894 -0.071363 -0.0076004 -0.0087753 0.0917645 0.0133 -0.0233857 0.0265271 -0.1790319 0.0401386 0.0171346 -0.0579954 -0.0372535 -0.0716749 0.0219329 -0.0503523 -0.0009834 -0.1639692 -0.0285183 -0.054408 0.0322224 -0.0928354 -0.049809 0.0880931 -0.015986 0.0485752 0.0478839 0.0337304 0.0133456 0.0013569 0.062276 -0.000263 -0.0986734 -0.0194872 -0.0385232 0.0060289 0.0698641 -0.0579045 0.030504 -0.0562909 0.001612 0.0072364 0.0236893 0.0079238 0.1916226 0.1584775 -0.0132713 0.0392567 -0.0437269 0.2275826 -0.0005155 0.0438989 0.0036653 0.3366386 0.0987687 -0.0309523 0.0391755 -0.0170309 -0.0278161 0.0673406 0.1020416 -0.00104 0.0729972 0.0216941 0.0113542 -0.0335795 0.0095499 0.0280473 -0.07576 0.0025836 -0.0524059 0.0191951 -0.0328907 0.1017587 0.0446133 0.0761832 0.0370769 -0.0139373 0.0544909 -0.0258259 0.1375578 -0.04234 0.0714458 0.0476266 0.1125765 0.0074591 -0.028582 0.0540718 -0.0205624 0.1637904 0.0799267 -0.0244139 0.0172631 -0.0406358 -0.1316326 -0.0051356 0.0175886 -0.0055879 0.1602375 -0.0913766 -0.0837087 0.0508956 -0.0900452 0.0477946 0.0153492 0.0545868 0.0154498 0.1529056 unknown
polarizability: 183.9067761|8.5544711|144.8587069|-7.6752679|5.1777969|70.7581513 unknown
InChI: InChI=1S/C10H10N2O2/c13-12(14)6-5-8-7-11-10-4-2-1-3-9(8)10/h1-4,7,11H,5-6H2
charge 0 multiplicity 1
24 atoms
O  -3.731033 1.493094 0.612537
O  -4.620473 -0.026018 -0.843684
N  1.765092 -2.113638 -0.033588
N  -3.627622 0.543662 -0.25358
C  -0.105944 -0.878824 0.414382
C  1.007817 0.030309 0.190533
C  -1.529907 -0.488881 0.711325
C  2.169391 -0.773086 -0.088869
C  0.3977 -2.172268 0.26793
C  -2.224556 0.048433 -0.570043
C  1.137278 1.445273 0.211015
C  3.436205 -0.206737 -0.351179
C  2.39769 2.016195 -0.050467
C  3.533641 1.199514 -0.330648
H  -2.100352 -1.354536 1.094092
H  -1.572672 0.30354 1.481247
H  -0.117297 -3.127002 0.361936
H  2.370904 -2.918593 -0.175943
H  -1.671873 0.912834 -0.974579
H  -2.330642 -0.727573 -1.341878
H  0.276609 2.085481 0.438256
H  4.31371 -0.82815 -0.561867
H  2.514568 3.105314 -0.036307
H  4.500363 1.674858 -0.53012
