program: Gaussian 09
title: 000247968
version: EM64L-G09RevD.01
frameworkgroup: C1[X(C18H22N2O)]
method: RPBEPBE
basis: SDD
operation: Freq
keyword: #p
keyword: freq=noraman
keyword: PBEPBE/SDD
title: #p freq=noraman PBEPBE/SDD
converged: YES YES NO NO
title: Mulliken charges:
elementType: O N N C C C C C C C C C C C C C C C C C C H H H H H H H H H H H H H H H H H H H H H H
charge: -0.460563 -0.098125 -0.043519 -0.072607 -0.182477 -0.491362 -0.412196 -0.448070 -0.382444 -0.485832 0.204651 0.454462 -0.375827 -0.446522 -0.376930 -0.180894 -0.374596 -0.189822 -0.222216 -0.229491 -0.246443 0.219000 0.230440 0.253096 0.238244 0.201836 0.193697 0.225778 0.236578 0.215380 0.187363 0.197035 0.220184 0.239400 0.341646 0.232406 0.256353 0.235203 0.236389 0.229265 0.223618 0.221992 0.225921
chargesum: 0.00000
title: Mulliken charges with hydrogens summed into heavy atoms:
elementType: O N N C C C C C C C C C C C C C C C C C C
charge: -0.118917 -0.098125 -0.043519 0.146393 0.047964 -0.000022 -0.016663 0.014285 0.020299 -0.068614 0.204651 0.454462 -0.136427 -0.214116 -0.120577 0.054309 -0.138208 0.039444 0.001402 -0.007499 -0.020522
polarizability: 2.06924647e+02 -1.38163869e+00 2.02353482e+02 -4.66517346e+00 -2.11122951e+00 1.95715956e+02
1716.lowfreq: -12.5318 -8.1272 -1.5647 -0.0004 0.0004 0.0005 23.1496 28.0108 28.5982
frequency: 23.1035 27.9872 28.5395 42.0688 58.8770 72.5540 91.7944 118.7104 152.1751 187.6553 209.2640 246.1194 255.0256 268.9028 285.2672 296.0894 314.7374 330.5673 401.5885 404.8507 406.3756 437.8311 462.5894 499.8067 509.6315 534.1367 596.2575 607.3311 616.2628 625.4246 680.7264 705.7945 746.5729 750.1129 781.9328 797.3142 812.6175 840.4492 859.0571 871.9433 881.0225 900.3631 901.7901 915.8358 940.7843 955.2523 963.1852 971.6557 982.2651 985.5770 989.9626 996.4011 998.1436 1003.8626 1020.7213 1025.4505 1040.4252 1054.6494 1075.9558 1083.3291 1102.6376 1117.2520 1129.1681 1146.7548 1163.4238 1168.5879 1176.6627 1178.3217 1189.0059 1204.4944 1207.6100 1211.7696 1242.8702 1264.7403 1273.7079 1278.8955 1294.1234 1301.7135 1312.3530 1316.0519 1328.8472 1331.8903 1346.6054 1357.0252 1367.9936 1375.5317 1390.4979 1406.5684 1416.2115 1439.5227 1453.4849 1456.1950 1465.8489 1469.3409 1479.4674 1480.2006 1482.4820 1563.4930 1580.5939 1594.2331 1614.1679 2838.7812 2851.2104 2879.9929 2941.4481 2982.0154 2988.2090 2999.2005 3001.5909 3004.1867 3017.7102 3039.1693 3067.3589 3112.5216 3120.6100 3120.7802 3132.4319 3134.3960 3144.9946 3149.3330 3160.3415 3167.6953 3574.9576
redmass: 4.5533 4.3422 4.2856 5.3037 5.0122 4.0358 3.2192 4.1631 2.5125 4.1125 3.8651 3.6836 1.2585 2.5276 3.2782 4.3340 3.1481 2.4254 2.1617 2.7664 2.8444 3.2320 2.9444 2.7389 3.5619 2.9425 4.8212 6.2494 6.2804 5.3786 4.0393 2.0323 1.6265 1.5752 2.5854 3.7341 3.7675 3.1597 1.2535 2.1127 1.6681 1.4037 2.2150 1.4795 2.1967 1.4698 3.6158 2.3335 1.3865 4.7804 5.9326 1.4131 1.3414 1.8778 1.8805 2.1042 2.3422 2.2214 1.6439 1.6950 2.2004 1.7742 1.9803 1.9403 1.0744 1.0686 1.2198 1.1343 1.2238 1.4475 1.5879 1.7106 1.5650 2.5838 1.4039 1.5241 1.3508 2.0025 1.6697 1.4002 1.4290 1.4090 1.4860 1.4326 1.5242 2.0645 2.7220 1.4626 2.0067 2.0825 2.1910 1.1164 1.1004 1.1068 1.1088 1.1465 1.8799 5.7286 5.8490 6.1842 6.1484 1.0705 1.0706 1.0687 1.0596 1.0865 1.0768 1.0817 1.0806 1.0862 1.0931 1.0909 1.1013 1.0866 1.0882 1.0863 1.0885 1.0914 1.0956 1.0945 1.1014 1.1015 1.0666
irintensity: 0.4054 1.0434 1.3457 0.8130 1.8114 1.1293 1.6448 4.3695 12.3812 1.7689 2.3130 6.4952 116.0072 23.9008 7.7926 2.0928 1.5066 3.3026 2.8422 4.8911 0.2498 4.3927 13.5438 6.1031 7.3990 8.2145 2.2449 1.7268 0.2753 3.0864 3.9445 36.2110 64.3325 36.6686 23.3757 11.0217 8.9115 7.8597 0.4105 4.2895 21.2920 4.1783 9.9449 3.6104 4.7089 2.7540 4.8327 7.7317 0.9950 68.8747 1.6658 2.4574 0.1349 8.1545 9.8270 16.1986 6.7158 32.4186 10.0603 7.8188 54.5434 3.0571 10.4216 1.8295 1.9748 0.4339 6.1796 2.8312 3.1452 4.4796 4.8227 13.5075 4.0523 11.2314 19.9614 16.3140 10.0975 4.6686 8.1025 0.9649 4.4259 5.5184 9.5075 2.6628 0.7082 0.9566 4.0756 1.9205 24.4700 12.7687 40.9546 11.1095 12.1052 7.9598 16.6442 3.5416 10.3453 12.0818 58.3392 0.8251 6.8172 37.1781 138.0892 54.2261 65.8686 20.1543 1.1482 6.1438 12.7363 66.7057 123.6488 26.1061 15.3355 7.8753 18.9808 0.1986 4.5613 17.5640 36.7121 29.4742 27.8592 26.3743 2.3288
temp: 298.150 k
press: 1.00000 atm
elementType: 8 7 7 6 6 6 6 6 6 6 6 6 6 6 6 6 6 6 6 6 6 1 1 1 1 1 1 1 1 1 1 1 1 1 1 1 1 1 1 1 1 1 1
symmnumber: 1
zpe: 949559.5 jmol-1
zpe.correction: 0.361668 hartree
zpe.thermalcorrener: 0.380722 hartree
zpe.thermalcorrenthalpy: 0.381666 hartree
zpe.thermalcorrgfe: 0.311696 hartree
zpe.sumelectzpe: -882.266316 hartree
zpe.sumelectthermal: -882.247262 hartree
zpe.sumelectthermalent: -882.246318 hartree
zpe.sumelectthermalfe: -882.316288 hartree
dipole: -0.5856 -0.5701 1.5596
dipole: 1.7607
quadrupole: -126.5212 -116.0407 -113.0125
quadrupole: -9.1475 3.7904 1.1699
quadrupole: -7.9964 2.4841 5.5123 -9.1475 3.7904 1.1699
hfenergy: -882.6279838 hartree
pointgroup: C01 [X(C18H22N2O1)]
dipole: -0.2498585 -0.2352879 0.6017344 debye
polarizability: 207.3054639|-1.170446|202.3613502|-4.2018659|-2.153061|195.327271 unknown
InChI: InChI=1S/C18H22N2O/c21-14-16-10-17(18-8-4-5-9-19-18)13-20(12-16)11-15-6-2-1-3-7-15/h1-9,16-17,21H,10-14H2
charge 0 multiplicity 1
43 atoms
O  1.783095 3.892326 1.625116
N  -0.823302 1.213991 -0.695461
N  2.848607 -1.139719 -0.988078
C  1.034159 2.864794 -0.440671
C  1.354216 0.397852 0.22422
C  2.039156 1.695942 -0.289703
C  -0.182277 2.416296 -1.283549
C  0.120691 0.068509 -0.655631
C  0.575138 3.433405 0.913014
C  -2.097795 0.866874 -1.366789
C  2.332084 -0.766822 0.229074
C  -2.966116 -0.095399 -0.559608
C  2.698162 -1.433575 1.426459
C  -3.729713 -1.09432 -1.211713
C  -3.064717 0.028876 0.849469
C  3.616804 -2.505432 1.374152
C  3.731063 -2.177533 -1.02586
C  4.147336 -2.890708 0.122003
C  -4.584934 -1.946574 -0.475234
C  -3.914215 -0.823006 1.588968
C  -4.681035 -1.81275 0.928813
H  1.542814 3.687636 -0.981795
H  0.999213 0.559169 1.260228
H  2.850872 1.998482 0.395148
H  2.494744 1.4698 -1.273123
H  -0.935972 3.226913 -1.330704
H  0.164061 2.220889 -2.331866
H  0.482895 -0.200691 -1.678688
H  -0.41202 -0.808073 -0.245207
H  0.037407 2.658445 1.495386
H  -0.119112 4.284105 0.737144
H  -1.930933 0.439075 -2.38871
H  -2.65603 1.814483 -1.512471
H  2.267178 -1.110113 2.380005
H  1.522998 4.270072 2.501728
H  -3.652519 -1.20819 -2.300594
H  -2.456228 0.792064 1.347656
H  3.911763 -3.029498 2.28985
H  4.115421 -2.44122 -2.018712
H  4.861133 -3.715888 0.033499
H  -5.168761 -2.715563 -0.994146
H  -3.980537 -0.716857 2.678207
H  -5.340891 -2.473971 1.50207
