program: Gaussian 09
title: 000247962
version: EM64L-G09RevD.01
frameworkgroup: C1[X(C18H21N)]
method: RPBEPBE
basis: SDD
operation: Freq
keyword: #pfreq=noraman
keyword: PBEPBE/SDD
title: #p freq=noraman PBEPBE/SDD
converged: YES YES NO NO
title: Mulliken charges:
elementType: N C C C C C C C C C C C C C C C C C C H H H H H H H H H H H H H H H H H H H H H
charge: -0.114953 0.104073 -0.570548 -0.010154 -0.510691 0.372796 0.392371 -0.724691 -0.644528 -0.424595 -0.390360 -0.358333 -0.397890 -0.248467 -0.240788 -0.251871 -0.250810 -0.244062 -0.247727 0.239684 0.226084 0.199377 0.234179 0.209435 0.205619 0.204322 0.248613 0.223372 0.192924 0.225284 0.245823 0.249642 0.226169 0.288372 0.223801 0.220990 0.223959 0.221731 0.227467 0.224382
chargesum: 0.00000
title: Mulliken charges with hydrogens summed into heavy atoms:
elementType: N C C C C C C C C C C C C C C C C C C
charge: -0.114953 0.104073 -0.104781 0.189223 -0.067077 0.372796 0.392371 -0.066137 -0.002947 -0.178772 -0.140718 -0.132164 -0.109518 -0.024666 -0.019798 -0.027912 -0.029079 -0.016595 -0.023345
polarizability: 2.25104575e+02 -6.11382655e+00 1.86134107e+02 1.22742280e+01 -1.42143270e+00 1.63053774e+02
1716.lowfreq: -12.5746 -5.1602 -0.0002 0.0002 0.0005 3.9335 23.1550 38.5194 57.0589
frequency: 21.2597 38.4989 57.0090 67.5784 85.8738 125.3738 137.0472 204.2286 214.1289 239.6336 241.3377 256.2592 276.4628 292.0349 314.8829 327.0888 342.6277 401.6618 403.7358 434.9581 453.9593 496.3660 538.2117 583.3318 602.8920 617.0446 621.0827 653.6452 705.1335 707.3720 713.7781 753.0737 766.7957 784.1768 847.8885 852.0842 857.7594 893.7761 903.8305 919.6581 926.9329 957.6865 975.3309 979.2616 990.4405 991.1446 993.7249 995.9758 1005.6591 1014.2914 1028.4278 1030.6989 1040.7112 1068.6185 1085.5169 1093.2427 1111.0202 1116.8117 1123.6380 1161.5311 1170.5372 1172.6319 1188.1721 1193.6014 1196.7493 1202.9419 1212.5783 1233.9935 1266.7516 1286.4261 1314.5579 1320.4434 1323.8987 1341.5872 1350.9014 1373.8625 1376.2662 1381.0546 1431.5737 1433.2403 1434.9141 1466.1454 1468.8474 1471.8998 1476.6829 1477.6357 1480.4419 1485.1951 1492.4303 1585.5527 1588.3439 1607.5467 1613.0600 2849.3962 2857.4708 2870.4931 2977.0514 3007.4230 3010.0740 3017.6212 3065.2543 3072.9672 3074.1631 3092.7005 3116.6572 3119.3650 3124.4429 3124.8513 3137.8572 3138.3984 3144.7488 3146.5890 3158.9241 3162.3936
redmass: 3.5444 3.6857 3.5631 4.0656 3.5373 3.4609 3.0213 1.4060 1.9406 2.9480 1.1136 3.7196 3.4458 3.8511 3.5181 2.2929 2.6775 2.8237 2.8745 2.6501 3.0165 3.4969 3.1295 3.3614 4.3309 6.3749 5.7082 5.5918 1.6776 1.7603 4.0823 2.6940 1.8630 2.1205 3.3629 1.2815 1.2506 2.1820 1.6031 1.4835 1.4862 2.9313 1.3953 1.6223 2.8465 2.6441 1.4545 1.8601 2.0372 2.3105 2.1592 2.0851 1.6748 1.9067 1.6138 1.7942 1.3968 1.9690 2.3722 1.8906 1.0520 1.0747 2.0320 1.3304 1.1280 1.8414 1.9748 3.1107 1.7754 1.3739 1.4575 1.3812 1.4234 1.3807 1.4097 6.4630 6.7691 1.2501 1.6927 2.0860 1.4898 1.0541 1.0667 1.0979 1.0605 1.1647 1.8728 1.9408 1.0962 6.0456 5.9806 5.9589 6.0390 1.0593 1.0750 1.0766 1.0358 1.0714 1.0779 1.0722 1.0994 1.1005 1.1031 1.1000 1.0842 1.0844 1.0874 1.0875 1.0921 1.0920 1.0957 1.0956 1.1015 1.1014
irintensity: 0.0608 0.0240 0.1097 0.1392 0.5877 0.6329 0.7166 0.4504 0.9970 0.4215 0.2378 4.2457 0.3315 0.7793 0.6018 2.3281 0.5899 0.2663 0.1348 1.8057 0.1425 7.4544 10.0108 12.6451 2.9357 0.0233 0.9488 10.6241 56.0518 51.1990 8.1254 5.2436 43.9169 26.8637 4.4782 0.2751 0.7844 5.3923 0.7652 0.7791 3.0056 11.1221 0.3139 1.1852 0.5910 0.1883 0.0638 1.6285 2.2695 3.9399 1.9598 18.7354 23.1321 17.0719 1.1531 2.8865 8.0851 2.5510 8.8961 14.5236 0.0483 1.2540 11.9588 9.0517 3.0013 4.5762 15.4354 3.8378 10.8076 16.0236 4.1144 0.6660 3.8681 5.8318 9.8708 3.6146 0.2383 17.5305 3.9030 10.1538 1.0051 1.9687 21.6113 8.1004 9.2617 10.8616 28.8034 14.2141 12.8596 1.3382 1.7432 15.5107 7.5318 92.6967 71.4747 195.4691 36.2679 48.1612 10.2067 45.4179 31.7518 26.7883 29.4580 36.7215 1.0184 4.8855 4.4924 4.1857 16.1432 17.3012 22.5014 43.7227 38.8747 22.4485
temp: 298.150 k
press: 1.00000 atm
elementType: 7 6 6 6 6 6 6 6 6 6 6 6 6 6 6 6 6 6 6 1 1 1 1 1 1 1 1 1 1 1 1 1 1 1 1 1 1 1 1 1
symmnumber: 1
zpe: 892016.5 jmol-1
zpe.correction: 0.339751 hartree
zpe.thermalcorrener: 0.356936 hartree
zpe.thermalcorrenthalpy: 0.357880 hartree
zpe.thermalcorrgfe: 0.294114 hartree
zpe.sumelectzpe: -751.866902 hartree
zpe.sumelectthermal: -751.849717 hartree
zpe.sumelectthermalent: -751.848773 hartree
zpe.sumelectthermalfe: -751.912539 hartree
dipole: 0.1367 -1.2584 0.1848
dipole: 1.2792
quadrupole: -108.0985 -111.5609 -108.5015
quadrupole: 2.0612 3.0083 0.0500
quadrupole: 1.2885 -2.1739 0.8855 2.0612 3.0083 0.0500
hfenergy: -752.2066527 hartree
pointgroup: C01 [X(C18H21N1)]
dipole: -0.1155231 -0.4796121 -0.0995849 debye
polarizability: 225.0458574|0.1570423|185.1838395|14.6275386|0.8247214|164.0627585 unknown
InChI: InChI=1S/C18H21N/c1-15-13-18(14-19(15)2,16-9-5-3-6-10-16)17-11-7-4-8-12-17/h3-12,15H,13-14H2,1-2H3
charge 0 multiplicity 1
40 atoms
N  1.782101 -1.986183 0.545394
C  0.000583 -0.509055 -0.101275
C  0.578627 -1.189819 -1.397882
C  1.812843 -2.03429 -0.950364
C  0.440406 -1.545328 0.977499
C  -1.533737 -0.361571 -0.104961
C  0.6532 0.88773 0.103509
C  3.159584 -1.529523 -1.505852
C  2.296373 -3.179458 1.228059
C  -2.311736 -0.415849 -1.288724
C  0.099648 2.023983 -0.546305
C  -2.207785 -0.118358 1.122643
C  1.818917 1.072056 0.891885
C  -3.716682 -0.252806 -1.248371
C  0.688863 3.300579 -0.414195
C  -3.608407 0.041517 1.169868
C  2.403595 2.351296 1.034134
C  -4.373119 -0.027329 -0.018705
C  1.844721 3.47304 0.381228
H  0.847646 -0.443797 -2.165009
H  -0.182369 -1.864085 -1.829935
H  1.664989 -3.087629 -1.29512
H  0.485325 -1.114459 1.995732
H  -0.301315 -2.383378 0.998096
H  4.003115 -2.114168 -1.09368
H  3.189395 -1.623285 -2.608048
H  3.31005 -0.470426 -1.234978
H  3.328279 -3.391747 0.896041
H  1.677932 -4.094163 1.039324
H  2.324942 -3.008482 2.319697
H  -1.826133 -0.580686 -2.256512
H  -0.810248 1.914694 -1.147093
H  -1.627047 -0.040473 2.049422
H  2.286516 0.198088 1.356901
H  -4.294862 -0.298946 -2.178528
H  0.240054 4.160791 -0.924635
H  -4.103024 0.224373 2.130739
H  3.302843 2.468146 1.650547
H  -5.4612 0.097923 0.014231
H  2.300811 4.463781 0.489522
