program: Gaussian 09
title: 000247951
version: EM64L-G09RevD.01
frameworkgroup: C1[X(C21H24N6O)]
method: RPBEPBE
basis: SDD
operation: Freq
keyword: #p
keyword: freq=noraman
keyword: PBEPBE/SDD
title: #p freq=noraman PBEPBE/SDD
converged: YES YES NO NO
title: Mulliken charges:
elementType: O N N N N N N C C C C C C C C C C C C C C C C C C C C C H H H H H H H H H H H H H H H H H H H H H H H H
charge: -0.276355 -0.420220 -0.420217 -0.099031 -0.099031 -0.504140 -0.504140 -0.412179 -0.412177 -0.368489 -0.368492 -0.477198 -0.477198 0.120372 0.120368 0.334787 0.334785 -0.370342 -0.370341 -0.360756 -0.360762 0.489347 0.489348 -0.338740 -0.338742 -0.483362 -0.483360 0.268653 0.204887 0.226895 0.226895 0.204887 0.212642 0.216430 0.212643 0.216431 0.205634 0.228641 0.205634 0.228641 0.298086 0.298086 0.279282 0.279282 0.216857 0.216863 0.306107 0.306107 0.211599 0.211598 0.286743 0.286743
chargesum: 0.00000
title: Mulliken charges with hydrogens summed into heavy atoms:
elementType: O N N N N N N C C C C C C C C C C C C C C C C C C C C C
charge: -0.276355 -0.122135 -0.122131 -0.099031 -0.099031 -0.217397 -0.217398 0.019604 0.019605 0.060583 0.060581 -0.042922 -0.042922 0.120372 0.120368 0.334787 0.334785 -0.091060 -0.091059 -0.143899 -0.143899 0.489347 0.489348 -0.032633 -0.032635 -0.271763 -0.271762 0.268653
polarizability: 5.66721592e+02 -8.34726977e-04 2.64575928e+02 1.47126364e+00 4.03304743e-03 1.40804359e+02
1716.lowfreq: -0.0014 -0.0007 0.0014 3.9861 5.7266 14.2641 26.4188 26.7486 32.1295
frequency: 19.4650 26.7481 32.1278 39.5154 49.6202 61.6851 68.8550 81.6771 88.6263 91.7674 117.3488 129.9061 140.3226 154.4302 181.4315 188.1236 215.1490 270.1218 275.9079 283.7613 325.2333 343.2102 347.7818 360.3516 368.8300 406.5261 409.6953 414.8147 415.6059 443.7358 451.2433 462.0794 495.9991 510.4461 512.3670 517.9027 529.9972 541.7609 604.1725 616.6090 629.4714 634.8252 663.9964 667.5521 678.8624 696.1711 741.9389 743.0289 765.8407 781.4669 795.8023 809.5842 815.6118 819.2581 845.2140 846.3129 873.1237 873.2879 879.1516 883.9675 884.6967 916.6931 916.8102 935.4109 935.9689 958.1775 958.2371 997.3891 1001.3462 1004.3163 1009.2929 1010.0853 1030.3945 1034.5738 1078.4820 1078.5523 1105.6551 1105.7452 1125.5783 1126.2838 1171.1439 1172.8545 1175.0270 1182.4713 1182.5606 1195.0761 1195.1034 1202.1979 1202.3547 1251.9366 1259.5579 1259.6466 1281.6056 1289.5616 1291.2938 1307.2966 1307.9874 1316.2068 1316.2306 1335.4138 1335.4738 1351.7712 1353.0142 1361.8909 1367.6889 1417.5456 1419.5743 1455.8180 1456.4089 1459.8976 1459.9378 1471.5080 1473.0667 1492.1320 1494.6615 1499.0716 1501.1518 1520.3527 1527.6536 1579.0895 1584.1488 1604.2909 1605.3391 1625.9298 1626.4192 1655.0798 2941.2163 2941.2434 2952.6255 2952.7227 2998.7739 2998.7824 3019.3023 3019.3210 3031.4899 3031.5363 3067.5867 3067.6033 3100.8131 3100.9303 3133.7713 3133.8766 3162.5763 3162.6116 3199.5452 3199.7263 3515.8214 3528.3063 3573.1226 3573.1288
redmass: 5.5366 4.2069 5.1703 4.6001 4.3468 3.5878 4.7736 4.8482 4.6160 3.7392 3.7401 3.4914 5.4328 4.4248 3.6707 3.2404 5.7161 4.4299 2.1869 2.5551 3.3492 3.1089 3.2793 6.5298 4.3754 1.9929 2.4766 2.4755 2.5517 1.9222 1.6847 2.3517 2.8099 4.7396 4.2882 2.5848 2.7957 2.5056 3.6990 1.1932 6.7912 6.8284 4.8725 4.7583 4.3201 11.5614 4.0578 4.0734 5.6604 3.5806 2.9269 3.3953 1.4848 1.6783 2.8389 2.8032 1.4772 1.4717 2.7956 1.8987 1.4271 2.8341 2.8338 1.4381 1.4334 2.6677 2.6785 5.1724 3.3271 3.9196 1.3831 1.3859 2.6426 2.4912 2.2450 2.2428 2.0935 2.0986 1.3590 1.3489 2.0729 1.5101 1.8157 1.2745 1.2808 1.2228 1.2134 1.8366 1.8084 2.2416 1.2019 1.2009 2.0040 1.7900 2.0191 1.6622 1.4106 1.2390 1.2277 1.4114 1.4111 1.4957 1.4886 4.5647 5.2234 4.4708 4.1366 1.1791 1.1503 1.1496 1.1507 1.3392 1.3451 1.6880 1.3576 2.0580 1.5019 2.4388 2.9154 4.8978 4.9874 5.9485 6.1081 6.4095 5.9991 4.0419 1.0669 1.0669 1.0681 1.0681 1.0650 1.0650 1.0928 1.0928 1.0917 1.0917 1.1044 1.1044 1.0877 1.0877 1.0947 1.0947 1.0907 1.0907 1.0947 1.0946 1.0766 1.0754 1.0772 1.0772
irintensity: 3.2338 0.1458 0.5380 0.4132 0.3037 0.1198 0.1642 14.4689 1.3017 1.7605 1.2898 3.5281 0.2189 0.1494 5.8367 0.2114 24.1476 3.7302 0.5328 3.5600 9.1360 51.0163 2.4393 17.8812 12.4308 37.8916 11.6325 18.1925 14.2234 56.4446 29.6966 0.0451 0.9625 0.3198 0.8421 0.6686 61.0469 0.8419 4.7050 115.8872 6.5151 0.0000 0.0026 38.5199 0.0262 18.8055 0.2570 6.9651 8.5163 1.5543 1.8614 25.2238 0.0001 69.4694 0.2044 1.3752 0.0263 2.6249 0.3184 0.0063 87.7733 7.5265 23.5174 0.0920 0.3743 3.9820 1.7311 0.2435 13.4531 0.3309 0.0034 2.2938 0.1272 4.5194 7.6408 3.0141 13.8574 1.5854 6.3029 26.7675 268.4786 4.9884 273.1910 4.6263 33.8198 1.6278 27.2188 128.2001 5.5910 301.2787 43.7081 1.2165 15.7841 0.4005 53.3243 15.7168 99.3708 34.6510 22.1400 37.6054 21.2893 398.6974 3.4444 9.2186 429.4464 3.1337 31.1792 224.5631 7.2964 54.1434 1.3146 346.1493 10.6696 12.6995 393.2740 895.4856 25.7288 186.5359 28.4475 187.2787 29.4470 19.4229 163.9059 182.5850 4.5124 87.3030 121.6796 18.4241 138.0438 74.5694 29.0039 3.3301 44.1620 72.6065 146.3562 13.4472 94.6896 20.8335 44.6454 16.0920 13.9678 33.1807 1.5660 0.3356 8.0316 0.4949 7.3928 14.5126 6.7776 11.4392
temp: 298.150 k
press: 1.00000 atm
elementType: 8 7 7 7 7 7 7 6 6 6 6 6 6 6 6 6 6 6 6 6 6 6 6 6 6 6 6 6 1 1 1 1 1 1 1 1 1 1 1 1 1 1 1 1 1 1 1 1 1 1 1 1
symmnumber: 1
zpe: 1114046.2 jmol-1
zpe.correction: 0.424318 hartree
zpe.thermalcorrener: 0.449465 hartree
zpe.thermalcorrenthalpy: 0.450409 hartree
zpe.thermalcorrgfe: 0.366893 hartree
zpe.sumelectzpe: -1216.366743 hartree
zpe.sumelectthermal: -1216.341596 hartree
zpe.sumelectthermalent: -1216.340651 hartree
zpe.sumelectthermalfe: -1216.424168 hartree
dipole: -0.0002 8.3073 0.0008
dipole: 8.3073
quadrupole: -93.4739 -150.1397 -171.0359
quadrupole: -0.0016 19.8946 0.0003
quadrupole: 44.7426 -11.9232 -32.8194 -0.0016 19.8946 0.0003
hfenergy: -1216.7910604 hartree
pointgroup: C01 [X(C21H24N6O1)]
dipole: -0.0001046 3.2683451 0.0004325 debye
polarizability: 566.7227759|0.0163554|264.5759245|1.2884172|0.0246237|140.8031793 unknown
InChI: InChI=1S/C21H24N6O/c28-21(26-17-7-3-15(4-8-17)19-22-11-1-12-23-19)27-18-9-5-16(6-10-18)20-24-13-2-14-25-20/h3-10,22,24,26-27H,1-2,11-14H2
charge 0 multiplicity 1
52 atoms
O  0.00056 -0.825891 0.000014
N  7.644189 0.569764 0.532865
N  -7.643169 0.569173 -0.53278
N  7.020359 -1.559824 -0.424154
N  -7.019219 -1.560697 0.423532
N  1.166287 1.226765 0.028156
N  -1.165385 1.226655 -0.027378
C  9.428087 -0.762385 -0.508866
C  -9.427057 -0.763572 0.508204
C  9.086164 0.272657 0.584359
C  -9.085099 0.271909 -0.584593
C  8.451026 -1.959257 -0.407035
C  -8.449838 -1.96029 0.406083
C  6.718367 -0.360081 0.037541
C  -6.717303 -0.360752 -0.037685
C  5.284625 0.068829 0.035192
C  -5.283606 0.068307 -0.03503
C  4.267954 -0.919355 -0.013798
C  -4.26684 -0.919792 0.013667
C  4.889027 1.431825 0.067159
C  -4.888142 1.431355 -0.066458
C  2.518347 0.785476 0.02846
C  -2.5174 0.785229 -0.027871
C  2.902781 -0.5835 -0.014102
C  -2.9017 -0.583802 0.014172
C  3.526496 1.786198 0.063466
C  -3.525648 1.785862 -0.062553
C  0.000493 0.437652 0.000219
H  10.476752 -1.093854 -0.398293
H  9.322074 -0.290264 -1.503508
H  -9.321251 -0.291799 1.503033
H  -10.475667 -1.095126 0.397355
H  9.372021 -0.129801 1.580075
H  9.65754 1.207404 0.428126
H  -9.370764 -0.130218 -1.580497
H  -9.656614 1.206528 -0.428099
H  8.654231 -2.532073 0.523655
H  8.614072 -2.659954 -1.246228
H  -8.652846 -2.532805 -0.524836
H  -8.612912 -2.661304 1.245006
H  7.298115 1.390548 1.027032
H  -7.297124 1.39016 -1.026629
H  4.584256 -1.965807 -0.061732
H  -4.583041 -1.966294 0.061186
H  5.636231 2.234113 0.048869
H  -5.63543 2.23356 -0.047912
H  2.132661 -1.355368 -0.043642
H  -2.131504 -1.355603 0.043464
H  3.244026 2.847681 0.075442
H  -3.243282 2.847378 -0.07412
H  1.053352 2.242366 0.059839
H  -1.052553 2.242279 -0.058673
