program: Gaussian 09
title: 000247923
version: EM64L-G09RevD.01
frameworkgroup: C1[X(C9H7N3O2)]
method: RPBEPBE
basis: SDD
operation: Freq
keyword: #pfreq=noraman
keyword: PBEPBE/SDD
title: #p freq=noraman PBEPBE/SDD
converged: NO YES NO NO
title: Mulliken charges:
elementType: O O N N N C C C C C C C C C H H H H H H H
charge: -0.148298 -0.148301 -0.373572 0.019555 0.019544 0.243673 0.074319 0.074405 0.120569 0.120627 -0.672430 -0.704003 -0.219691 -0.219634 0.237531 0.253148 0.237472 0.241989 0.241981 0.235272 0.365845
chargesum: 0.00000
title: Mulliken charges with hydrogens summed into heavy atoms:
elementType: O O N N N C C C C C C C C C
charge: -0.148298 -0.148301 -0.007727 0.019555 0.019544 0.243673 0.074319 0.074405 0.120569 0.120627 0.055720 0.015238 -0.219691 -0.219634
polarizability: 1.15727638e+02 -3.38738949e-02 1.28654653e+02 -5.24203696e+00 -1.46159436e-02 9.21116881e+01
1716.lowfreq: -7.5429 -0.0004 -0.0003 0.0006 6.0674 14.7611 75.5465 89.1935 122.0927
frequency: 75.5453 89.1935 122.0882 134.4104 139.2221 139.7756 155.6457 179.9817 212.0169 234.4306 319.0603 352.2082 365.8155 400.2988 419.0899 435.9107 439.6822 520.9636 550.9661 572.2389 604.0343 617.4245 645.1451 687.9112 725.3261 777.4545 785.3729 906.4952 924.2186 962.6645 992.7370 1036.7354 1069.7559 1115.6727 1161.1732 1238.3332 1261.5383 1265.9523 1332.7638 1335.4171 1399.2591 1413.7367 1458.8648 1462.1098 1479.5209 1484.5754 1672.2309 1703.8108 2204.9605 2206.1883 2996.9217 3000.5461 3086.1234 3092.0549 3107.6149 3114.2296 3545.2532
redmass: 12.3694 11.1089 3.4261 8.7789 1.4371 7.7216 2.5067 1.5467 4.7461 1.7960 6.7185 6.1096 3.6789 3.4885 7.4718 12.9374 9.7872 6.3965 3.9370 7.9279 7.0734 9.7387 3.3283 4.6622 1.5649 10.5697 8.3893 7.6361 3.2915 1.3511 1.3509 3.5877 2.9916 2.0588 3.4582 5.6843 9.2009 6.4324 6.1835 1.6480 1.2150 1.1865 1.0450 1.0483 1.0453 1.0794 8.0121 12.8729 12.6335 12.6260 1.0367 1.0373 1.0998 1.0992 1.1001 1.0985 1.0794
irintensity: 0.3382 2.4254 1.9783 6.5706 0.0739 4.9525 0.6908 0.0001 1.2300 0.0984 8.4917 0.0937 4.0154 0.4518 3.0005 3.9848 0.8100 2.3431 1.6299 5.1839 5.6010 20.0471 29.1265 1.0549 100.2486 6.6078 23.2182 4.3261 0.7658 1.0523 0.0203 0.7496 42.5839 73.1813 11.2331 50.5045 28.1284 173.5555 21.8072 10.9602 19.0160 11.2034 1.8857 10.3031 11.0921 1.9824 584.6908 91.6885 10.4681 13.9718 4.2066 15.2925 0.6770 14.8090 9.9117 12.5502 81.7230
temp: 298.150 k
press: 1.00000 atm
elementType: 8 8 7 7 7 6 6 6 6 6 6 6 6 6 1 1 1 1 1 1 1
symmnumber: 1
zpe: 381206.0 jmol-1
zpe.correction: 0.145194 hartree
zpe.thermalcorrener: 0.158572 hartree
zpe.thermalcorrenthalpy: 0.159517 hartree
zpe.thermalcorrgfe: 0.105898 hartree
zpe.sumelectzpe: -660.824779 hartree
zpe.sumelectthermal: -660.811400 hartree
zpe.sumelectthermalent: -660.810456 hartree
zpe.sumelectthermalfe: -660.864075 hartree
dipole: -2.5116 -0.0055 5.0183
dipole: 5.6118
quadrupole: -83.0574 -106.2823 -76.9372
quadrupole: 0.0529 8.3640 0.0206
quadrupole: 5.7016 -17.5233 11.8217 0.0529 8.3640 0.0206
hfenergy: -660.9699724 hartree
pointgroup: C01 [X(C9H7N3O2)]
dipole: 1.1943839 -0.0150437 1.8568167 debye
dipolederiv: -0.5649938 0.2899162 0.1027182 0.2121787 -1.015721 -0.093348 0.0889511 -0.0884786 -0.3102776 -0.578338 -0.3012036 0.1053272 -0.2235162 -1.0023206 0.0911339 0.0913715 0.0866233 -0.3103654 -0.6182641 -0.0103845 0.0410409 -0.01034 -1.419068 -0.0001872 0.1003732 -0.0009887 -0.3611683 -0.1869236 -0.062475 -0.017101 -0.0051473 -0.1985301 -0.0208695 0.0047315 -0.0178158 -0.1907933 -0.1851212 0.0620744 -0.0166197 0.0047822 -0.2002316 0.0213138 0.0051987 0.0176808 -0.1908424 0.0639289 0.005681 -0.0407494 0.0055079 0.5019918 0.0006379 -0.1098769 0.001352 0.565625 -0.3211944 0.1167629 0.1187391 0.1190354 -0.1005681 -0.1703835 0.1281438 -0.3655232 -0.0556144 -0.3271156 -0.1107718 0.1232929 -0.113151 -0.0943052 0.1673295 0.137876 0.3621223 -0.0560028 1.1056605 0.0072013 -0.3278763 -0.1760141 1.616367 0.0754366 -0.2866671 0.0028247 0.2666109 1.1104461 0.0057299 -0.3298427 0.1890368 1.6116647 -0.0678327 -0.2868392 0.003661 0.2666332 -0.0930194 0.0013893 -0.0266819 0.0015895 0.011493 -0.0000633 0.0624021 -0.0008868 -0.0565562 -0.0378235 -0.0002024 0.0259302 -0.0001056 -0.051837 -0.0002501 -0.0618181 0.0009225 -0.078512 0.0755658 0.2177541 0.1072333 0.1227208 0.0343062 0.0871851 0.0578977 0.0884817 -0.0017627 0.0666325 -0.2184574 0.1050249 -0.1234913 0.0430732 -0.0899677 0.0555523 -0.0899329 -0.0016191 0.0718329 -0.012377 0.029596 0.0162062 -0.0216322 -0.1121027 0.0228531 -0.0844358 0.0295968 0.012438 0.0011565 -0.0678517 0.0010769 0.1115737 0.0007536 -0.095958 0.0010419 -0.0030245 0.0717526 0.0101081 0.0322561 -0.0185527 -0.0208278 0.1117089 0.0250783 0.0841568 0.0286939 0.0848441 0.0254117 -0.0108728 0.0177788 -0.0180557 -0.1112084 -0.0122447 -0.0782266 0.0046582 0.0835165 -0.0282429 -0.0077519 -0.0205844 -0.0167592 0.1114285 -0.0101014 0.0785179 0.0045938 -0.08386 0.0023664 0.0372416 0.002426 0.0912516 -0.0005553 0.0902728 -0.001265 0.0877913 0.2500357 -0.0014373 0.0169469 -0.0014369 0.1381352 -0.0001596 -0.0071966 0.0001684 0.3623355 unknown
polarizability: 116.5765769|0.1535002|128.6527891|2.5991368|-0.0418858|91.2646138 unknown
InChI: InChI=1S/C9H7N3O2/c1-7(2)8(3-10)5(13)12-6(14)9(7,8)4-11/h12H,1-2H3
charge 0 multiplicity 1
21 atoms
O  1.711715 -2.372524 -0.541537
O  1.7727 2.327122 -0.543026
N  2.030898 -0.026467 -0.555021
N  -2.122684 -2.248138 -0.990547
N  -2.063535 2.30237 -0.991202
C  -0.324385 0.004627 1.306378
C  -0.148134 -0.783718 -0.044878
C  -0.127646 0.787357 -0.045266
C  1.277154 -1.212907 -0.405464
C  1.308224 1.17926 -0.406164
C  -1.737954 0.023619 1.884163
C  0.767704 -0.009889 2.370959
C  -1.228517 -1.579614 -0.569323
C  -1.187018 1.610908 -0.569917
H  -1.869381 0.92138 2.513786
H  -2.522591 0.031879 1.110272
H  -1.891858 -0.867877 2.517579
H  0.667796 0.884821 3.010826
H  0.643348 -0.901371 3.011021
H  1.791674 -0.024001 1.966639
H  3.030792 -0.039537 -0.773581
