program: Gaussian 09
title: 000247926
version: EM64L-G09RevD.01
frameworkgroup: C1[X(C14H16N4O4)]
method: RPBEPBE
basis: SDD
operation: Freq
keyword: #p
keyword: freq=noraman
keyword: PBEPBE/SDD
title: #p freq=noraman PBEPBE/SDD
converged: YES YES NO NO
title: Mulliken charges:
elementType: O O O O N N N N C C C C C C C C C C C C C C H H H H H H H H H H H H H H H H
charge: -0.195807 -0.195609 -0.433696 -0.433727 -0.194949 -0.195048 -0.019547 -0.019649 0.206764 0.206951 -0.091858 -0.091721 -0.046726 -0.046263 0.196004 0.195965 -0.392227 -0.391382 -0.324217 -0.325442 -0.780123 -0.780390 0.262300 0.239688 0.262009 0.239917 0.220604 0.237585 0.220526 0.238548 0.243612 0.278590 0.239704 0.239929 0.243620 0.278593 0.353790 0.353681
chargesum: 0.00000
title: Mulliken charges with hydrogens summed into heavy atoms:
elementType: O O O O N N N N C C C C C C C C C C C C C C
charge: -0.195807 -0.195609 -0.079906 -0.080046 -0.194949 -0.195048 -0.019547 -0.019649 0.206764 0.206951 -0.091858 -0.091721 -0.046726 -0.046263 0.196004 0.195965 0.109761 0.110544 0.133972 0.133633 -0.018217 -0.018249
polarizability: 2.92800386e+02 5.37989545e+00 2.21583975e+02 -5.57681635e-02 1.30125486e-02 1.05254995e+02
1716.lowfreq: -5.6173 -1.7848 -0.0007 -0.0003 0.0005 3.4077 33.3935 38.2942 41.0788
frequency: 33.3928 38.2691 41.0784 55.0075 64.2056 94.5066 95.5489 124.2157 130.4951 130.7790 138.2519 163.1536 171.2528 180.0041 217.4993 262.1806 270.5331 277.0087 288.2080 298.5609 324.7293 335.1970 347.9383 352.0834 356.4899 362.9703 376.9567 431.6510 470.6019 488.6305 517.5132 576.6584 643.1269 660.1364 666.2652 681.2772 682.4095 707.9835 758.1431 781.5155 785.0294 808.8686 815.8897 841.7131 855.6136 976.6254 979.3358 985.1952 985.4483 1005.2272 1025.9287 1029.2143 1034.0172 1041.9318 1047.5346 1047.7507 1077.6062 1087.6277 1176.8254 1189.1394 1215.3548 1234.8117 1261.5588 1274.7322 1310.3917 1315.1060 1323.7395 1331.7446 1350.3990 1352.4501 1357.7280 1360.1318 1379.9535 1380.1491 1401.1630 1401.5125 1417.7074 1421.1227 1449.4748 1449.7866 1459.8976 1465.4838 1468.9261 1471.4312 1471.6365 1473.4815 1474.4494 1486.5361 1498.1140 1502.0062 1560.3974 1578.3521 2986.7268 2986.9579 3004.6686 3005.5123 3038.6435 3038.7546 3062.4724 3062.7690 3080.9482 3081.0338 3110.7415 3110.8222 3125.0050 3125.0539 3571.1044 3571.6425
redmass: 7.0753 6.0474 5.4642 4.0342 9.3154 2.0106 2.1330 5.3171 1.1391 1.1383 3.7426 4.4081 3.3587 4.6702 4.7671 4.5121 2.8832 2.6796 5.7140 5.9471 5.6838 8.6270 1.2532 1.3175 2.7950 4.0692 5.2233 4.8939 4.1466 11.0264 5.2998 10.9703 4.4318 5.8259 5.5608 6.0672 10.2081 5.3738 11.4899 2.0612 1.4765 1.9597 4.3829 3.4174 11.6812 2.7766 3.8809 2.2745 2.0958 3.0667 5.5584 4.6811 2.3430 6.1504 1.5395 1.5199 1.6426 1.8737 1.8361 1.7127 6.7164 6.8775 2.0295 1.6350 1.7044 1.3942 1.2918 1.7358 3.5140 2.5381 1.7045 1.6103 1.3316 1.3660 1.2538 1.2369 3.9652 3.1211 1.1422 1.1578 5.6943 1.3421 1.4744 1.0573 1.0537 1.1372 1.1227 6.6949 3.4745 3.7123 10.6400 10.7248 1.0399 1.0399 1.0612 1.0609 1.0589 1.0589 1.0975 1.0975 1.1034 1.1032 1.1074 1.1074 1.0967 1.0967 1.0665 1.0665
irintensity: 0.4555 4.8742 0.0670 1.6414 0.3939 5.1823 2.4794 2.8943 0.3393 2.9406 1.0260 4.2358 9.6088 0.4007 1.9783 7.4350 2.5084 5.1719 0.1571 0.0580 10.4363 10.2041 116.7148 53.3686 118.2002 42.7948 2.3347 0.7839 2.2891 0.0052 0.0044 1.7545 16.8075 7.8953 1.7276 0.7159 0.1065 0.2952 2.8748 18.3517 0.2973 36.8378 0.0385 0.0120 0.1430 202.5251 4.8829 119.2361 0.2220 79.2887 60.1388 10.2300 0.2567 45.5321 0.2929 4.5237 89.9524 0.0221 0.0214 28.8630 35.7747 0.0029 0.0376 39.9051 0.5541 0.8366 0.3413 71.4572 2.5549 0.3266 1.2745 71.7030 0.2594 2.6222 1.0513 5.5142 87.5145 5.8147 86.3929 18.1077 0.4684 5.2714 0.1314 4.4711 8.6309 12.9166 42.3243 385.5935 164.9695 0.2683 395.8707 0.0712 26.9421 12.1095 22.3778 22.5926 37.6379 18.4356 12.2981 13.4626 8.2895 8.8586 24.4390 2.7643 2.2248 3.6439 20.6738 17.4874
temp: 298.150 k
press: 1.00000 atm
elementType: 8 8 8 8 7 7 7 7 6 6 6 6 6 6 6 6 6 6 6 6 6 6 1 1 1 1 1 1 1 1 1 1 1 1 1 1 1 1
symmnumber: 1
zpe: 767138.5 jmol-1
zpe.correction: 0.292188 hartree
zpe.thermalcorrener: 0.313697 hartree
zpe.thermalcorrenthalpy: 0.314641 hartree
zpe.thermalcorrgfe: 0.240800 hartree
zpe.sumelectzpe: -1061.372297 hartree
zpe.sumelectthermal: -1061.350788 hartree
zpe.sumelectthermalent: -1061.349843 hartree
zpe.sumelectthermalfe: -1061.423685 hartree
dipole: 0.0187 -0.0295 -1.1229
dipole: 1.1234
quadrupole: -118.6419 -141.0560 -128.5392
quadrupole: 14.6017 -0.0328 -0.0625
quadrupole: 10.7705 -11.6436 0.8732 14.6017 -0.0328 -0.0625
hfenergy: -1061.6644846 hartree
pointgroup: C01 [X(C14H16N4O4)]
dipole: -0.0079224 0.0130243 -0.4417355 debye
polarizability: 292.997393|0.7320017|220.8074481|-6.1741339|6.5716694|105.834515 unknown
InChI: InChI=1S/C14H16N4O4/c1-7-15-9-11(17(7)3-5-19)14(22)10-12(13(9)21)18(4-6-20)8(2)16-10/h19-20H,3-6H2,1-2H3
charge 0 multiplicity 1
38 atoms
O  -1.44816 2.448369 -0.011903
O  1.339718 -2.431691 -0.385686
O  -5.192965 2.152522 1.468057
O  5.187931 -2.276332 0.879806
N  -2.807574 -0.277432 -0.175124
N  2.696353 0.300434 -0.324317
N  1.592943 2.290734 -0.172316
N  -1.704525 -2.268184 -0.322321
C  -1.442999 0.025169 -0.17912
C  1.333333 -0.005209 -0.272803
C  0.67265 1.244721 -0.18543
C  -0.782924 -1.224119 -0.277844
C  -0.802084 1.354678 -0.11595
C  0.69272 -1.335646 -0.320127
C  -2.923448 -1.673614 -0.258099
C  2.811331 1.697555 -0.255804
C  -3.912433 0.69568 -0.055376
C  3.804187 -0.674785 -0.386537
C  -4.122525 1.157037 1.409889
C  4.103679 -1.301444 0.999504
C  -4.23089 -2.400211 -0.288792
C  4.116117 2.428743 -0.291438
H  -3.668821 1.574602 -0.675188
H  -4.837394 0.232321 -0.435679
H  3.521294 -1.476438 -1.088955
H  4.705304 -0.165671 -0.765605
H  -4.468806 0.32027 2.039137
H  -3.171845 1.553068 1.8151
H  4.475405 -0.537494 1.702568
H  3.182979 -1.759955 1.407754
H  -4.809288 -2.175625 -1.20472
H  -4.021887 -3.480199 -0.272808
H  -4.868682 -2.153722 0.579577
H  4.809452 2.089949 0.49979
H  4.631637 2.310188 -1.263043
H  3.911754 3.499258 -0.141287
H  -4.845052 3.021593 1.14478
H  4.832114 -3.110824 0.48271
