program: Gaussian 09
title: 000247903
version: EM64L-G09RevD.01
frameworkgroup: C1[X(C9H10Cl2O)]
method: RPBEPBE
basis: SDD
operation: Freq
keyword: #p
keyword: freq=noraman
keyword: PBEPBE/SDD
title: #p freq=noraman PBEPBE/SDD
converged: NO YES NO NO
title: Mulliken charges:
elementType: Cl Cl O C C C C C C C C C H H H H H H H H H H
charge: -0.046575 -0.016475 -0.391587 0.484872 0.179022 0.668915 -0.556181 0.190057 -0.604922 -0.834057 -0.813223 -0.791047 0.254498 0.254453 0.238558 0.253250 0.192268 0.253358 0.248134 0.243703 0.248142 0.344838
chargesum: 0.00000
title: Mulliken charges with hydrogens summed into heavy atoms:
elementType: Cl Cl O C C C C C C C C C
charge: -0.046575 -0.016475 -0.046748 0.484872 0.179022 0.668915 -0.556181 0.190057 -0.604922 -0.086549 -0.114348 -0.051068
polarizability: 1.56033256e+02 1.81329909e-01 1.46187077e+02 -7.04805598e-04 8.44208901e-03 6.04453715e+01
1716.lowfreq: -78.0611 -9.6504 -8.7956 0.0009 0.0021 0.0021 6.0478 73.6657 87.1506
frequency: -77.7966 73.6398 87.1412 94.3087 112.4280 139.1603 192.8607 211.4782 246.2879 289.1416 305.7808 318.8669 352.4291 359.9290 364.7600 371.2671 387.4837 463.1993 569.0333 577.3916 597.5827 616.2195 674.7377 770.1836 799.5737 930.7020 999.2482 1017.1733 1017.2386 1041.7563 1042.0346 1046.1803 1077.2465 1139.3820 1183.6891 1335.9332 1354.2617 1390.2429 1398.4469 1400.8990 1413.7221 1433.9483 1454.3508 1462.6836 1469.4229 1474.0028 1479.6593 1492.9118 1561.9302 1606.5408 2976.9762 2992.2413 2995.2225 3053.0971 3064.1790 3067.4897 3071.4561 3119.0886 3125.2142 3578.9513
redmass: 1.1093 1.3813 3.6600 1.3755 1.7693 2.4994 3.3062 17.1409 6.3159 1.3965 3.4010 5.5705 3.9309 3.4670 3.6613 4.7135 5.6318 5.3048 5.3128 4.1585 3.1341 6.1323 5.9131 5.4078 4.2722 2.4463 2.0688 1.5203 2.2843 1.7282 1.4969 1.5885 2.3159 2.1127 2.7769 7.7711 6.0537 2.5253 1.3048 1.2413 1.4244 2.8681 1.0435 1.2528 1.0446 1.2196 1.0435 1.1483 5.3322 7.7592 1.0375 1.0391 1.0384 1.0958 1.0970 1.0994 1.0974 1.0967 1.0978 1.0650
irintensity: 0.6655 0.1485 0.0770 0.0703 3.8126 0.7429 2.6344 0.6655 2.5958 86.5992 5.0382 3.6233 25.5029 12.6080 0.5401 2.5251 3.3478 1.8772 4.3721 0.2736 10.1393 0.0030 40.4138 2.9985 24.0717 20.2731 28.2565 13.6954 44.6262 13.8280 5.3739 1.7014 37.9380 83.1063 146.9780 3.7488 28.2686 36.8318 30.5339 7.6244 27.2098 5.0521 26.1904 13.6167 15.6512 29.3899 0.0498 43.5444 7.9570 0.0099 36.8561 18.3354 12.3254 33.3527 13.3408 10.7382 12.0291 19.0142 6.2968 30.1328
temp: 298.150 k
press: 1.00000 atm
elementType: 17 17 8 6 6 6 6 6 6 6 6 6 1 1 1 1 1 1 1 1 1 1
symmnumber: 1
zpe: 432105.6 jmol-1
zpe.correction: 0.164580 hartree
zpe.thermalcorrener: 0.177257 hartree
zpe.thermalcorrenthalpy: 0.178201 hartree
zpe.thermalcorrgfe: 0.125414 hartree
zpe.sumelectzpe: -1343.408213 hartree
zpe.sumelectthermal: -1343.395536 hartree
zpe.sumelectthermalent: -1343.394592 hartree
zpe.sumelectthermalfe: -1343.447379 hartree
dipole: 1.5716 3.4234 -0.0027
dipole: 3.7669
quadrupole: -92.5960 -69.5268 -86.5784
quadrupole: 0.2757 0.0060 -0.0027
quadrupole: -9.6956 13.3736 -3.6780 0.2757 0.0060 -0.0027
hfenergy: -1343.572793 hartree
pointgroup: C01 [X(C9H10Cl2O1)]
dipole: -0.9261947 1.1568345 0.0173438 debye
dipolederiv: -0.4624162 -0.32095 -0.0196241 -0.3201328 -0.469989 -0.0205694 -0.0197314 -0.0206928 -0.0650417 -0.7425244 0.1224507 -0.0118501 0.1588189 -0.1164386 0.0011774 -0.0106066 0.0004199 -0.0418588 -0.6629694 -0.6736268 -0.028363 -0.6060673 -0.7874758 -0.0265282 -0.0258512 -0.0279163 -0.3852624 0.1789527 -0.1148833 -0.0005596 -0.1193199 -0.0551706 -0.0060214 -0.0005299 -0.0059203 0.0401015 -0.1594857 -0.2566491 -0.0094143 -0.0360916 0.0737138 0.0052088 -0.0021875 -0.0000658 -0.1136613 -0.2389761 -0.1478218 -0.0119467 -0.0638484 0.1446732 0.0005154 -0.0092574 -0.0016233 0.0760224 0.4467124 0.5783791 0.0334568 0.5402366 0.4239091 0.0324007 0.0323818 0.0334842 -0.1842301 0.334323 0.7104604 0.0281414 0.5748173 0.6550571 0.0303711 0.0236861 0.0337453 0.115512 0.9821862 -0.1545389 0.0201294 -0.333883 -0.091073 -0.006062 0.0141773 -0.0021338 -0.1367293 -0.1861623 0.0024864 -0.0052969 -0.0347741 0.0810749 0.0002931 -0.006785 0.0011783 0.0459028 0.0269086 0.1067816 0.0027813 0.0608193 -0.0556975 -0.0028625 0.001184 -0.0015638 0.0736227 0.0376271 -0.0338087 -0.0013803 0.0476027 -0.1834774 -0.0064692 0.0012085 -0.0082194 0.052161 0.0098848 0.007264 -0.0483185 -0.0244384 0.0773445 -0.0765825 -0.0898803 -0.0437427 -0.0309184 0.0035229 0.0018216 0.0500502 -0.0340368 0.0690681 0.0816583 0.0894169 0.0503248 -0.0161349 0.0906892 0.0162774 0.0003546 0.0983802 -0.1351323 -0.0054165 0.0032251 -0.0073164 0.0981103 0.0187712 0.0715951 0.1039972 0.0345719 0.0247928 -0.0069862 0.094321 -0.0572062 -0.0228701 -0.1157981 -0.2011763 -0.0125503 -0.0941886 -0.0175235 -0.0064531 -0.0087042 -0.0090802 0.10527 0.0288668 0.0750559 -0.0964299 0.0404773 0.0193005 0.0124496 -0.0893536 0.0644614 -0.0280643 0.0823676 -0.0189627 -0.0846727 0.0040515 0.0161042 -0.0500401 -0.0487096 -0.0844958 -0.0311165 -0.072129 0.0918406 -0.0012638 -0.0113994 0.1159813 -0.0001946 -0.0045734 0.0021223 0.1142777 0.0761456 -0.02821 0.087784 -0.0015233 0.0073342 0.0524004 0.0534571 0.0857029 -0.0162976 0.323503 0.1662147 0.0049753 0.119928 0.2036238 -0.0022888 0.0031121 -0.0014623 0.3512048 unknown
polarizability: 155.4904833|2.0844238|146.5879895|2.2342794|2.8224038|60.5872317 unknown
InChI: InChI=1S/C9H10Cl2O/c1-4-5(2)9(12)8(11)6(3)7(4)10/h12H,1-3H3
charge 0 multiplicity 1
22 atoms
Cl -2.21895 -2.267117 -0.103439
Cl 3.146314 -0.695606 0.069661
O  2.040527 1.974305 0.130991
C  -1.374895 0.392944 0.002451
C  -0.384315 1.417548 0.058051
C  0.416487 -1.363214 -0.013071
C  -0.939538 -0.951032 -0.030915
C  0.990439 1.047086 0.077245
C  1.366396 -0.318607 0.041874
C  -2.857788 0.716495 -0.021083
C  -0.798842 2.883077 0.096277
C  0.801552 -2.826662 -0.050933
H  -3.333556 0.307677 -0.931214
H  -3.374567 0.249331 0.837126
H  -3.051503 1.798439 0.010085
H  -1.424265 3.101342 0.980674
H  0.053027 3.586751 0.142418
H  -1.377944 3.161502 -0.802743
H  0.406315 -3.309284 -0.962807
H  1.893621 -2.951685 -0.030338
H  0.366575 -3.365731 0.809818
H  1.692611 2.899745 0.154069
