program: Gaussian 09
title: 000247900
version: EM64L-G09RevD.01
frameworkgroup: C1[X(C9H10ClNO2)]
method: RPBEPBE
basis: SDD
operation: Freq
keyword: #p
keyword: freq=noraman
keyword: PBEPBE/SDD
title: #p freq=noraman PBEPBE/SDD
converged: NO YES NO NO
title: Mulliken charges:
elementType: Cl O O N C C C C C C C C C H H H H H H H H H H
charge: -0.066812 -0.311274 -0.269193 -0.466288 0.508510 -0.434905 -0.370728 -0.215123 -0.041843 -0.185955 -0.258227 0.266157 -0.672211 0.252554 0.305102 0.334089 0.230434 0.230435 0.232900 0.257573 0.214530 0.230137 0.230137
chargesum: 0.00000
title: Mulliken charges with hydrogens summed into heavy atoms:
elementType: Cl O O N C C C C C C C C C
charge: -0.066812 -0.311274 -0.269193 -0.132199 0.508510 -0.182351 -0.065626 0.245747 -0.041843 0.046945 -0.000653 0.266157 0.002593
polarizability: 1.96332614e+02 2.99366512e+00 1.23194324e+02 9.72185615e-04 1.44156501e-02 5.70538869e+01
1716.lowfreq: -29.8315 -7.2605 0.0022 0.0026 0.0030 1.9342 14.1419 49.3934 69.2179
frequency: -23.9365 49.3880 69.0856 78.9878 126.2493 180.0391 184.4958 222.7900 243.2635 254.0877 310.1269 354.5004 387.5646 408.6425 438.1631 560.6366 599.1711 645.5071 663.8268 684.5849 704.2099 720.9360 788.6696 798.5425 833.6654 862.2943 872.6881 908.7036 978.6657 988.4130 988.7934 1043.7062 1074.0264 1098.0699 1111.4485 1139.1748 1163.0033 1180.1788 1250.2263 1251.3966 1309.1337 1353.7563 1377.8947 1398.2411 1414.6247 1462.8446 1475.6425 1475.8753 1488.7164 1518.0165 1586.3370 1614.7610 1661.4364 2996.4905 3009.2707 3067.9099 3093.7281 3108.2369 3145.7192 3146.8471 3178.7348 3195.2244 3542.5198
redmass: 2.2589 4.3089 6.1754 4.8983 3.3752 6.2820 5.3385 6.5411 1.4735 2.5518 6.0619 6.1139 3.8812 8.4730 3.0478 4.2127 6.6272 1.3884 7.5036 2.3260 5.1709 6.3730 1.3166 1.0952 4.6643 1.5809 4.6438 1.3646 5.9086 1.3126 3.9242 3.7939 2.0236 1.5455 2.2294 1.4649 3.3059 1.0871 1.1300 1.7320 1.5240 1.4221 4.2575 1.2810 3.1379 1.0406 1.7973 1.2877 1.0861 2.2806 5.1008 6.4903 8.3215 1.0357 1.0579 1.1070 1.0985 1.1027 1.0912 1.0902 1.0953 1.0957 1.0761
irintensity: 0.0006 0.1118 6.2923 0.4840 3.9661 6.3498 1.0444 2.5681 0.0924 4.5266 12.1095 2.0669 7.5828 4.6117 7.6200 3.7635 4.6308 44.2750 12.7788 30.0789 48.1829 19.0758 56.4196 3.6028 62.0144 49.6529 15.6830 3.8730 12.9998 3.7120 41.9409 218.3530 34.4302 21.8806 19.3880 5.0000 519.6837 1.3632 0.0085 12.8694 18.9856 43.3255 79.5651 28.4453 70.9481 12.3615 34.2749 74.3838 24.1324 387.1658 165.4539 168.7127 220.4094 21.5385 23.8702 8.8218 30.2574 45.2436 10.9548 3.4457 2.5476 5.8261 32.0894
temp: 298.150 k
press: 1.00000 atm
elementType: 17 8 8 7 6 6 6 6 6 6 6 6 6 1 1 1 1 1 1 1 1 1 1
symmnumber: 1
zpe: 459604.6 jmol-1
zpe.correction: 0.175054 hartree
zpe.thermalcorrener: 0.187056 hartree
zpe.thermalcorrenthalpy: 0.188001 hartree
zpe.thermalcorrgfe: 0.135709 hartree
zpe.sumelectzpe: -1013.275678 hartree
zpe.sumelectthermal: -1013.263676 hartree
zpe.sumelectthermalent: -1013.262732 hartree
zpe.sumelectthermalfe: -1013.315024 hartree
dipole: 2.5561 -1.0233 -0.0003
dipole: 2.7533
quadrupole: -74.9007 -81.0471 -85.7717
quadrupole: -10.1000 -0.0010 0.0009
quadrupole: 5.6725 -0.4740 -5.1985 -10.1000 -0.0010 0.0009
hfenergy: -1013.4507323 hartree
pointgroup: C01 [X(C9H10Cl1N1O2)]
dipole: -1.0307247 -0.3331373 0.000126 debye
dipolederiv: -0.5392882 0.3187762 -0.0000398 0.403445 -0.464633 0.0000564 -0.0000519 0.0000554 -0.0782701 -2.1320664 -0.2631739 -0.0000755 -0.6211018 -0.5803005 0.000066 -0.0002599 0.0000036 -0.3131947 -0.8167436 0.0428753 -0.0000215 0.2280265 -0.9343638 0.0000522 -0.0001925 0.000308 -0.3364037 -2.2283197 0.0727278 -0.0000771 0.3513629 -0.3806858 0.0000446 -0.0000819 0.0000253 -0.3342712 1.5198931 0.1425105 -0.000088 0.4808772 0.1716506 -0.000014 -0.0002209 -0.0000265 0.1187496 -0.6007995 0.0412231 0.0000021 0.261096 -0.1261381 -0.0000326 0.0000076 -0.0000114 -0.1837805 -0.3513226 -0.0131601 -0.0000014 -0.3340931 -0.1374914 0.0000074 0.000098 -0.0000189 -0.1827233 1.1855702 0.0453992 0.0000976 -0.2081449 0.2376069 0.0000036 0.0002025 0.0000391 0.3572501 0.8767224 -0.4093782 0.000033 -0.6062745 0.7528501 -0.0001274 0.0000419 -0.0001286 -0.0338363 0.2603292 -0.0755902 -0.0000061 0.0717022 0.1721883 -0.0000632 -0.0000503 -0.0000611 -0.12509 -0.3043662 0.1553901 -0.0000318 0.1734074 -0.3381641 0.000026 -0.0000229 0.0000262 -0.1543034 2.8718942 0.0125993 0.0001299 -0.2248848 1.3672169 -0.0001661 0.000454 -0.0003532 0.3108694 -0.1207158 -0.0880724 0.0000123 -0.0543115 -0.0041624 0.0000197 -0.0000084 0.0000189 0.0639864 0.0717656 -0.062556 0.0000231 -0.0623481 -0.0310556 0.0000471 0.0000285 0.000048 0.1788312 0.1468156 0.0586046 0. 0.051678 0.0810295 0.0000184 0.0000147 0.0000242 0.1845922 0.1916792 0.0366615 0.0000085 0.005622 0.1582942 0.0000386 0.0000417 0.0000364 0.3277815 -0.0634963 -0.026441 -0.0171404 0.074776 -0.000465 -0.091602 0.0227352 -0.1027898 -0.0610217 -0.0635412 -0.0264692 0.0171702 0.074712 -0.0003115 0.0915769 -0.0227825 0.1027393 -0.0611909 0.0564022 -0.0297326 0.0000112 -0.0502715 -0.0941789 0.0000534 0.0000139 0.0000549 0.1534779 -0.041108 -0.0385825 0.000023 -0.0268584 0.0955744 0.000019 0.0000246 0.0000207 0.1784588 -0.1575228 0.0609856 -0.0000709 0.0849077 0.0448258 0.0000458 -0.0000887 0.0000404 0.1172237 0.1190997 0.0227394 0.0381524 -0.0366413 0.0052649 -0.1025346 0.008091 -0.1165807 -0.0634662 0.1191189 0.0226636 -0.0381108 -0.0366828 0.0054486 0.1024648 -0.0079937 0.11653 -0.0636689 unknown
polarizability: 195.5860454|-7.93772|123.9408928|-0.0000123|-0.0144484|57.0538869 unknown
InChI: InChI=1S/C9H10ClNO2/c1-2-13-9(12)11-8-5-3-4-7(10)6-8/h3-6,11H,2H2,1H3
charge 0 multiplicity 1
23 atoms
Cl 4.359122 -1.888903 0.000213
O  -2.894226 -0.585046 0.000161
O  -1.891617 1.548388 -0.000431
N  -0.640955 -0.472076 0.000317
C  0.702321 -0.015892 0.00009
C  1.721287 -1.007618 0.000219
C  1.052328 1.36118 -0.000225
C  -4.235072 0.070073 -0.000363
C  3.06465 -0.601467 0.000038
C  2.41569 1.722982 -0.000401
C  3.445196 0.753746 -0.000273
C  -1.797624 0.29584 0.000167
C  -5.270332 -1.04995 -0.00008
H  1.467909 -2.073333 0.000456
H  0.265958 2.11788 -0.000326
H  -0.799163 -1.482212 0.000603
H  -4.308908 0.714177 0.894482
H  -4.308586 0.713431 -0.89577
H  2.685369 2.784501 -0.000641
H  4.499818 1.040898 -0.000408
H  -6.286674 -0.615753 -0.000445
H  -5.164687 -1.686003 -0.895362
H  -5.165007 -1.685244 0.895778
