program: Gaussian 09
title: 000247895
version: EM64L-G09RevD.01
frameworkgroup: C1[X(C14H17N3O)]
method: RPBEPBE
basis: SDD
operation: Freq
keyword: #p
keyword: freq=noraman
keyword: PBEPBE/SDD
title: #p freq=noraman PBEPBE/SDD
converged: YES YES NO NO
title: Mulliken charges:
elementType: O N N N C C C C C C C C C C C C C C H H H H H H H H H H H H H H H H H
charge: -0.444054 -0.046360 -0.005603 -0.005602 -0.352719 -0.352716 -0.569214 -0.569230 0.496590 0.496588 -0.359059 -0.345999 -0.345975 -0.359035 -0.329997 -0.333806 -0.333816 -0.330005 0.225216 0.229748 0.229763 0.225192 0.236122 0.221543 0.221530 0.236146 0.235283 0.239132 0.239136 0.235283 0.360643 0.238630 0.239007 0.239006 0.238630
chargesum: 0.00000
title: Mulliken charges with hydrogens summed into heavy atoms:
elementType: O N N N C C C C C C C C C C C C C C
charge: -0.083411 -0.046360 -0.005603 -0.005602 0.102245 0.102238 -0.111549 -0.111554 0.496590 0.496588 -0.123776 -0.106866 -0.106839 -0.123751 -0.091367 -0.094799 -0.094810 -0.091375
polarizability: 2.12665389e+02 -1.34996070e-03 1.45260813e+02 -1.62740866e-03 2.07561545e+01 1.51386172e+02
1716.lowfreq: -16.5341 -6.3261 -0.0006 0.0004 0.0007 2.7305 17.8059 29.2635 31.0986
frequency: 15.5414 29.2588 31.0691 43.1306 51.5834 82.0753 89.5713 137.9330 147.0966 197.5979 256.4913 273.3861 324.1720 327.6857 348.1851 369.3675 369.5456 384.0947 420.9490 469.6744 517.8315 533.9033 569.7864 619.3005 663.3449 663.4073 730.1308 751.6054 755.6907 788.5758 806.2593 806.7583 810.2944 835.5376 848.4043 888.7337 889.0479 960.2693 960.8660 963.0458 963.5902 973.7314 977.0742 977.2366 986.6712 1018.0470 1029.2122 1062.5453 1062.5660 1071.5116 1076.4805 1095.2161 1103.0926 1179.7922 1186.8910 1217.5327 1217.5580 1226.8899 1226.9941 1246.4843 1271.9361 1277.2895 1287.1891 1305.4309 1309.9454 1312.4492 1335.4781 1337.1733 1341.7465 1384.2260 1404.3237 1404.3776 1438.5349 1451.6296 1466.7544 1466.8493 1486.1492 1486.7315 1557.0702 1557.1404 1588.9346 1589.9238 2928.6320 2936.5358 3005.2704 3005.6734 3027.0043 3036.2124 3071.8363 3073.3953 3123.5430 3123.5568 3124.5611 3124.6071 3144.6417 3144.7074 3151.5106 3151.5395 3551.5263
redmass: 3.6637 4.9814 5.3959 3.9003 3.5729 5.6361 3.4587 2.3493 5.8942 6.5017 4.2994 5.3084 1.5994 2.3399 1.5072 2.4882 2.4856 3.9181 2.7975 4.3929 3.4279 3.7832 4.5447 4.5311 6.9210 6.9149 5.4157 3.6221 3.3497 1.2188 1.7295 2.2805 1.3595 1.9080 2.5137 1.2472 1.2473 3.8579 6.0148 2.0253 1.4678 2.6584 1.4900 1.5111 2.0628 3.2200 1.7609 2.2124 2.2108 2.0130 3.8531 1.4758 1.6065 1.2789 1.4809 1.3941 1.3897 1.8691 1.9287 1.2471 1.3911 1.3079 1.6297 1.7225 5.8715 2.1888 1.3099 1.2649 1.3515 1.3646 2.0245 2.0238 1.0851 1.0861 2.0251 2.0168 1.0971 1.0973 6.7794 6.7736 5.7340 5.7264 1.0653 1.0645 1.0588 1.0589 1.0942 1.0938 1.1042 1.1038 1.0867 1.0867 1.0884 1.0884 1.0962 1.0962 1.0994 1.0995 1.0680
irintensity: 0.0641 0.6562 0.6250 0.5893 0.6694 0.9860 0.6641 0.0017 0.0414 1.1749 10.2925 13.1390 69.9504 1.7159 101.7511 0.0516 0.3669 1.0767 11.9840 0.2241 37.5822 8.1794 34.8680 0.2314 0.0109 0.8071 7.8736 0.0060 0.3588 0.7425 36.6826 10.6308 2.7561 75.3850 4.3609 0.0086 0.0097 3.7954 3.2989 3.4931 0.8500 10.0004 0.0456 0.2817 5.8015 6.2067 0.5456 4.6356 5.0841 26.2663 1.4072 2.1291 14.6368 7.1321 0.0216 1.3220 1.0185 7.0173 1.4525 45.3430 2.8877 5.7288 0.8964 2.3757 0.1928 3.4490 7.3379 1.8817 29.4374 0.3108 0.6903 33.5799 1.1260 6.5560 14.2798 4.8452 0.4100 14.5663 0.1448 25.1841 106.6253 24.7342 8.0424 65.7454 0.3407 44.3799 3.1639 12.6994 2.6814 37.8044 4.4627 7.0462 16.5501 8.8716 0.2740 109.7286 0.6585 0.1242 22.4370
temp: 298.150 k
press: 1.00000 atm
elementType: 8 7 7 7 6 6 6 6 6 6 6 6 6 6 6 6 6 6 1 1 1 1 1 1 1 1 1 1 1 1 1 1 1 1 1
symmnumber: 1
zpe: 750156.4 jmol-1
zpe.correction: 0.285719 hartree
zpe.thermalcorrener: 0.302594 hartree
zpe.thermalcorrenthalpy: 0.303538 hartree
zpe.thermalcorrgfe: 0.237252 hartree
zpe.sumelectzpe: -781.773710 hartree
zpe.sumelectthermal: -781.756836 hartree
zpe.sumelectthermalent: -781.755892 hartree
zpe.sumelectthermalfe: -781.822178 hartree
dipole: 0.0004 2.0486 -2.4788
dipole: 3.2158
quadrupole: -155.9193 -104.4420 -100.5638
quadrupole: 0.0047 0.0053 6.8015
quadrupole: -35.6109 15.8663 19.7445 0.0047 0.0053 6.8015
hfenergy: -782.0594295 hartree
pointgroup: C01 [X(C14H17N3O1)]
dipole: 0.0002181 0.7403351 -1.0259582 debye
polarizability: 212.6653823|0.0133983|148.0017413|0.0115399|20.9784312|148.6452505 unknown
InChI: InChI=1S/C14H17N3O/c18-17(11-5-13-1-7-15-8-2-13)12-6-14-3-9-16-10-4-14/h1-4,7-10,18H,5-6,11-12H2
charge 0 multiplicity 1
35 atoms
O  -0.000606 2.278667 -0.383099
N  0.000192 0.816374 -0.810758
N  -6.092599 -1.060886 0.846922
N  6.093157 -1.057258 0.850318
C  -1.232728 0.234474 -0.202845
C  1.233112 0.235495 -0.201864
C  -2.507236 0.798536 -0.874284
C  2.507689 0.800837 -0.872099
C  -3.762217 0.169287 -0.296488
C  3.762712 0.172103 -0.293835
C  -4.392423 -0.940757 -0.913833
C  4.333838 0.647202 0.914968
C  -4.33417 0.644474 0.911891
C  4.393776 -0.937431 -0.911218
C  -5.538041 -1.514736 -0.317238
C  5.480712 0.012961 1.441922
C  -5.480975 0.00982 1.438491
C  5.539388 -1.511028 -0.314249
H  -1.266467 0.422094 0.893857
H  -1.176735 -0.859706 -0.361372
H  1.178251 -0.858702 -0.36067
H  1.265736 0.422917 0.894906
H  -2.516635 1.892064 -0.716047
H  -2.440479 0.612356 -1.961964
H  2.441787 0.615194 -1.959925
H  2.516228 1.894284 -0.713271
H  -4.002767 -1.351178 -1.852669
H  3.897442 1.506937 1.436507
H  -3.89845 1.504591 1.433366
H  4.004774 -1.347754 -1.850368
H  -0.000376 2.753078 -1.255303
H  -6.042457 -2.37009 -0.781652
H  5.939153 0.366824 2.372624
H  -5.940044 0.363742 2.368861
H  6.044458 -2.365985 -0.778683
