program: Gaussian 09
title: 000247888
version: EM64L-G09RevD.01
frameworkgroup: C1[X(C10H9NO3)]
method: RPBEPBE
basis: SDD
operation: Freq
keyword: #p
keyword: freq=noraman
keyword: PBEPBE/SDD
title: #p freq=noraman PBEPBE/SDD
converged: YES YES NO NO
title: Mulliken charges:
elementType: O O O N C C C C C C C C C C H H H H H H H H H
charge: -0.213251 -0.159621 -0.196980 -0.306680 -0.186377 0.452328 -0.662741 0.170088 0.253419 -0.340243 -0.356247 -0.218491 -0.235741 -0.243693 0.270951 0.253831 0.250727 0.236723 0.291001 0.238422 0.234420 0.232147 0.236006
chargesum: 0.00000
title: Mulliken charges with hydrogens summed into heavy atoms:
elementType: O O O N C C C C C C C C C C
charge: -0.213251 -0.159621 -0.196980 -0.306680 0.084575 0.452328 0.078540 0.170088 0.253419 -0.049242 -0.117825 0.015929 -0.003594 -0.007687
polarizability: 1.68694854e+02 2.48154738e+00 1.26866071e+02 2.52297447e+00 9.93830716e+00 6.28982470e+01
1716.lowfreq: -8.3783 -2.8677 -0.0012 -0.0010 -0.0010 9.6054 38.9292 82.1054 106.5447
frequency: 38.8498 82.0852 106.5254 154.2561 155.7655 200.5820 242.5493 253.2894 302.5275 351.6212 401.4884 407.9347 415.2607 514.6144 583.0610 600.3038 615.1820 653.9234 666.7581 675.6702 695.8883 735.2752 763.7640 817.5367 836.3145 844.0109 912.1078 962.5915 973.4605 985.9588 991.1379 997.8309 1035.6502 1082.9116 1091.6766 1103.1578 1142.2578 1177.8951 1196.3894 1203.4733 1269.5347 1291.8628 1334.7343 1344.3735 1383.4078 1395.3594 1449.0837 1467.4632 1481.0144 1489.8308 1592.7201 1613.7489 1708.0955 1768.1032 3006.6953 3009.8289 3111.0287 3116.1003 3134.4246 3144.1838 3157.4701 3171.3379 3193.2858
redmass: 5.2360 4.0842 4.5247 12.2984 5.5873 1.0517 3.3224 4.5796 8.5281 6.1194 6.3420 3.3168 4.2293 3.3388 9.3634 7.3087 6.5288 5.8019 7.0951 9.4382 2.0190 3.6771 1.6911 3.9690 1.4143 6.0392 1.4054 2.7253 1.4023 5.4423 2.6737 1.3752 2.0472 2.1677 1.6615 1.9672 3.5896 1.0560 5.8776 1.1324 1.8809 1.3765 1.3784 2.5881 7.7919 1.1934 2.3430 1.0613 1.0519 2.3069 6.3915 5.9687 12.2670 12.5904 1.0380 1.0806 1.1013 1.1011 1.0853 1.0892 1.0940 1.0997 1.0954
irintensity: 0.1908 3.1953 0.7249 1.9742 2.1596 0.3487 0.1713 5.2015 8.6415 1.2065 6.3762 1.4001 6.9097 9.6544 4.7818 37.8066 0.6405 6.6559 5.4814 11.8273 36.0810 7.7091 84.1632 0.0764 35.7952 295.5119 6.4686 13.4217 0.4926 2.0673 33.4206 3.0770 7.8048 27.4500 6.9776 108.8863 19.6694 0.3646 140.1601 2.8586 52.6988 2.6174 15.9795 204.6127 0.5556 22.5807 9.1105 18.2488 2.2939 117.2595 3.3801 48.8209 493.6718 289.0899 6.8121 10.7759 11.3062 11.4830 2.3372 8.7228 32.2249 11.6136 3.8631
temp: 298.150 k
press: 1.00000 atm
elementType: 8 8 8 7 6 6 6 6 6 6 6 6 6 6 1 1 1 1 1 1 1 1 1
symmnumber: 1
zpe: 452219.7 jmol-1
zpe.correction: 0.172241 hartree
zpe.thermalcorrener: 0.184024 hartree
zpe.thermalcorrenthalpy: 0.184968 hartree
zpe.thermalcorrgfe: 0.133857 hartree
zpe.sumelectzpe: -665.901795 hartree
zpe.sumelectthermal: -665.890013 hartree
zpe.sumelectthermalent: -665.889069 hartree
zpe.sumelectthermalfe: -665.940180 hartree
dipole: 4.3731 -4.2641 0.5077
dipole: 6.1290
quadrupole: -90.4536 -83.4568 -80.5195
quadrupole: 3.2924 -1.9418 1.9937
quadrupole: -5.6436 1.3532 4.2905 3.2924 -1.9418 1.9937
hfenergy: -666.0740367 hartree
pointgroup: C01 [X(C10H9N1O3)]
dipole: 1.7494799 -1.6530958 0.1451778 debye
dipolederiv: -1.3647544 -0.3954914 -0.0807828 -0.8771708 -1.0660113 -0.0568012 -0.1271411 -0.115638 -0.2016272 -1.1367993 -0.2697274 -0.1165082 -0.3611739 -0.5718501 -0.0374427 -0.1011343 -0.0422577 -0.3216872 -0.5460434 -0.2604809 -0.0135965 0.1440746 -1.2312919 -0.0267412 -0.0082775 -0.0811713 -0.3150274 -1.4290546 0.1688244 0.0134051 0.5991665 -0.8893047 0.016357 0.0096447 0.0143698 -0.2283324 0.0046586 0.3749986 -0.0844046 0.4319227 0.2352433 0.0025692 -0.0094338 0.0245597 0.3107566 1.2329367 -0.1458144 -0.0485433 -0.1232754 0.0311916 0.0388277 0.0169317 -0.0032257 0.0998553 -0.0346655 -0.0120937 -0.0006471 -0.1085134 -0.0181276 0.0325289 0.0364858 0.0214223 0.0047634 1.4604986 0.205501 0.1987578 0.8936483 1.369166 0.0919367 0.1948102 0.1266307 0.23957 1.9310928 0.3267667 0.103625 -0.5723952 1.9599089 0.0531154 0.0052269 0.1479893 0.3144052 -0.3134069 -0.0106802 0.0053755 -0.1446878 -0.0402614 0.0430466 -0.0167531 0.0180847 -0.1454358 -0.2069619 0.0357451 0.0046839 0.1956659 -0.0541481 0.0312766 0.0474739 0.0571927 -0.1709468 0.1006116 0.0518954 0.0213783 0.0762923 0.1002251 0.0928283 0.0369016 0.076211 -0.1067665 0.0460611 -0.0070128 0.0012577 -0.0915778 0.1075283 0.0949875 -0.031824 0.090805 -0.1105392 0.0156504 -0.0188717 -0.0011062 0.0028253 -0.1380655 0.005336 0.0053337 0.0033874 -0.165487 0.0848729 -0.0012255 0.0435625 -0.0483902 0.0062252 -0.0419847 0.0222288 -0.0541866 -0.0460921 0.0067362 -0.1122133 -0.011045 -0.0870748 0.0053573 0.0009868 -0.023879 -0.0081558 0.0854843 -0.0409778 0.1032366 -0.0262586 0.1113071 0.0715842 0.0173859 -0.0261278 0.0014282 0.0770174 0.0969632 0.0140276 0.0226765 0.0402975 0.0252312 -0.1005165 0.0175884 -0.0393715 -0.0401994 0.1441994 0.0522518 0.01765 0.0213393 0.0641771 -0.0454605 0.0226558 -0.0322323 0.1605887 0.0123605 -0.1019368 -0.0413779 -0.1122471 0.0025941 -0.0484862 -0.0582479 -0.0553041 0.1357718 0.0076753 -0.0770935 -0.0310637 -0.0947126 -0.0145454 -0.0630604 -0.0419933 -0.0587756 0.132638 0.047358 0.0576125 0.0202518 0.0800493 -0.0535308 -0.0766302 0.0289521 -0.0717709 0.130845 -0.1190114 0.0217821 0.0027099 0.0246302 0.0987044 -0.0240589 0.000578 -0.0199912 0.1604455 unknown
polarizability: 168.6211088|3.1841007|126.3635239|1.896736|11.7137115|63.4745385 unknown
InChI: InChI=1S/C10H9NO3/c1-7-9(12)14-10(13)11(7)8-5-3-2-4-6-8/h2-7H,1H3
charge 0 multiplicity 1
23 atoms
O  -2.592226 1.073479 -0.046048
O  -3.869706 -0.868021 -0.304553
O  -0.766301 2.544384 0.177832
N  -0.472708 0.169835 0.00815
C  -1.3881 -0.994536 -0.084138
C  0.958737 0.037209 -0.004425
C  -1.330811 -1.950242 1.130885
C  -2.767615 -0.329665 -0.175418
C  -1.162054 1.378598 0.064976
C  1.799448 1.108496 0.398927
C  1.539523 -1.186293 -0.432654
C  3.199983 0.944388 0.368994
C  2.942075 -1.33445 -0.453115
C  3.782419 -0.272534 -0.05171
H  -1.211602 -1.556162 -1.021289
H  -2.102388 -2.729419 1.011576
H  -0.343285 -2.432132 1.20983
H  -1.526772 -1.401338 2.06753
H  1.362631 2.057983 0.713812
H  0.915688 -2.021068 -0.766171
H  3.83758 1.778924 0.679995
H  3.374892 -2.282765 -0.789492
H  4.870591 -0.390571 -0.069193
