program: Gaussian 09
title: 000247892
version: EM64L-G09RevD.01
frameworkgroup: C1[X(C13H8ClF3N4)]
method: RPBEPBE
basis: SDD
operation: Freq
keyword: #p
keyword: freq=noraman
keyword: PBEPBE/SDD
title: #p freq=noraman PBEPBE/SDD
converged: YES YES NO NO
title: Mulliken charges:
elementType: Cl F F F N N N N C C C C C C C C C C C C C H H H H H H H H
charge: 0.032368 -0.152071 -0.151924 -0.129230 -0.147048 -0.020643 0.089342 0.077798 -0.583307 0.183896 -0.038786 0.503601 -0.197972 0.072316 -0.414945 -0.357910 0.319813 -0.389651 -0.218805 -0.224724 -0.229684 0.266037 0.240737 0.277890 0.230677 0.256448 0.233330 0.235412 0.237035
chargesum: 0.00000
title: Mulliken charges with hydrogens summed into heavy atoms:
elementType: Cl F F F N N N N C C C C C C C C C C C C C
charge: 0.032368 -0.152071 -0.151924 -0.129230 -0.147048 -0.020643 0.089342 0.077798 -0.076534 0.183896 -0.038786 0.503601 0.079918 0.072316 -0.184268 -0.101462 0.319813 -0.389651 0.014525 0.010688 0.007351
polarizability: 2.13894741e+02 -3.23006720e+01 1.86245804e+02 -1.22913751e+00 1.78713927e+01 1.20464252e+02
1716.lowfreq: -21.3336 -10.8848 -3.9101 -0.0006 0.0010 0.0018 1.3117 9.5951 26.8108
frequency: -18.3453 3.6209 26.6192 28.4235 78.5727 110.8477 115.1137 141.9854 160.2112 214.8969 235.7744 270.8044 290.2723 300.7565 331.0220 357.3166 366.2418 375.4736 403.6567 455.9242 458.1916 466.0405 528.3892 581.3711 612.7952 615.7898 635.6782 651.0270 660.8773 677.3150 694.4679 712.2789 749.0505 782.0240 805.0737 815.4679 826.0880 856.7264 860.4305 904.4794 925.4321 951.0316 984.2986 990.6168 1002.0046 1004.3962 1025.9962 1045.0833 1057.4454 1085.6200 1119.9858 1146.1628 1176.5165 1179.6841 1192.5126 1213.8014 1243.1767 1291.9434 1300.8020 1304.8094 1330.0097 1341.3661 1368.6741 1384.2381 1388.0260 1442.0122 1449.5700 1472.2261 1486.1949 1537.1238 1567.4516 1596.6371 1614.1479 3025.3419 3085.2932 3117.1566 3126.9673 3138.7259 3152.3082 3168.6844 3234.6507
redmass: 5.8021 16.1135 5.1390 6.2225 8.4103 11.2174 10.2354 6.9396 8.0085 7.1141 8.6118 7.9382 14.0677 6.5036 4.7402 4.9716 5.3105 12.0610 2.8167 14.0270 4.3151 10.2736 5.9959 5.0813 9.3729 6.9492 5.7619 11.2763 9.6457 11.7552 4.9706 1.6433 5.0539 3.3067 7.0896 3.2098 13.0684 1.5171 1.3177 6.1106 1.5704 1.8668 1.3886 6.1812 12.9990 1.3242 2.2794 12.5825 5.6948 1.9255 2.5622 5.1967 1.0567 2.5077 1.1332 2.7838 2.5314 5.4820 2.3912 5.8237 2.6672 1.5905 1.6807 8.7738 6.3765 2.3113 2.2984 1.5037 2.0491 10.6320 9.7464 6.0448 5.9754 1.0595 1.1052 1.0887 1.0878 1.0907 1.0957 1.1015 1.0990
irintensity: 0.1751 0.2874 0.1347 0.3338 0.1610 0.0521 0.3152 1.1688 1.4960 1.1440 3.3993 0.0971 0.4243 1.6731 1.2056 0.1280 0.2955 1.7403 0.1543 2.2378 2.7479 8.0590 12.7267 8.7832 28.1210 7.1443 24.0030 6.2615 4.6039 2.1148 10.1801 94.5282 43.1181 1.1608 5.6243 10.5742 39.7999 6.6761 2.3749 87.5738 2.0384 16.8660 0.0999 0.6056 227.8046 0.5012 8.0038 82.3764 91.5600 51.3559 65.9426 148.5759 0.2063 48.3905 2.6006 11.6721 163.9879 91.6224 46.5873 72.8983 111.9849 67.0073 8.6877 3.7669 18.5737 34.5814 36.0703 44.3655 17.2932 24.0116 99.1779 1.7309 2.1319 19.9980 3.1642 9.0968 1.8302 6.6431 25.8285 19.4552 0.5855
temp: 298.150 k
press: 1.00000 atm
elementType: 17 9 9 9 7 7 7 7 6 6 6 6 6 6 6 6 6 6 6 6 6 1 1 1 1 1 1 1 1
symmnumber: 1
zpe: 504998.9 jmol-1
zpe.correction: 0.192344 hartree
zpe.thermalcorrener: 0.208812 hartree
zpe.thermalcorrenthalpy: 0.209756 hartree
zpe.thermalcorrgfe: 0.143813 hartree
zpe.sumelectzpe: -1477.292700 hartree
zpe.sumelectthermal: -1477.276232 hartree
zpe.sumelectthermalent: -1477.275287 hartree
zpe.sumelectthermalfe: -1477.341230 hartree
dipole: 7.9825 -0.4771 -1.9632
dipole: 8.2342
quadrupole: -126.8322 -135.0310 -119.1932
quadrupole: -9.5192 2.7496 6.3379
quadrupole: 0.1866 -8.0122 7.8257 -9.5192 2.7496 6.3379
hfenergy: -1477.4850435 hartree
pointgroup: C01 [X(C13H8Cl1F3N4)]
dipole: -3.1138458 0.5999798 -0.6625157 debye
polarizability: 208.2548219|-33.3943186|196.0583082|-7.2811518|-2.1775259|116.2916664 unknown
InChI: InChI=1S/C13H8ClF3N4/c14-12-19-10(13(15,16)17)9-11(20-12)21(7-18-9)6-8-4-2-1-3-5-8/h1-5,7H,6H2
charge 0 multiplicity 1
29 atoms
Cl 1.717257 -3.859584 -0.975012
F  4.288829 1.567324 -0.210345
F  3.499716 1.165777 1.883272
F  4.872577 -0.329572 0.879867
N  -0.703288 0.687864 -1.042549
N  1.018755 1.935254 -0.142092
N  0.374327 -1.53217 -1.044354
N  2.653873 -1.469903 -0.171577
C  -2.046373 0.333988 -1.572121
C  0.339511 -0.199665 -0.809311
C  1.410779 0.590644 -0.252679
C  -3.09992 0.204184 -0.477988
C  -0.240264 1.944369 -0.61621
C  2.585273 -0.130236 0.055471
C  -4.117852 1.178532 -0.33922
C  -3.067152 -0.899747 0.412037
C  3.810676 0.547774 0.647833
C  1.563895 -2.082838 -0.699642
C  -5.089065 1.058054 0.681422
C  -4.03402 -1.01854 1.433221
C  -5.046403 -0.039134 1.571102
H  -1.9141 -0.621242 -2.109975
H  -2.332932 1.106886 -2.306207
H  -0.866252 2.832847 -0.67392
H  -4.157723 2.029942 -1.030723
H  -2.290191 -1.665815 0.29932
H  -5.874506 1.815123 0.780495
H  -4.003071 -1.874027 2.116523
H  -5.797559 -0.133287 2.362863
