program: Gaussian 09
title: 000247875
version: EM64L-G09RevD.01
frameworkgroup: C1[X(C11H15N)]
method: RPBEPBE
basis: SDD
operation: Freq
keyword: #pfreq=noraman
keyword: PBEPBE/SDD
title: #p freq=noraman PBEPBE/SDD
converged: YES YES NO NO
title: Mulliken charges:
elementType: N C C C C C C C C C C C H H H H H H H H H H H H H H H
charge: -0.051556 0.502245 -0.532550 0.151126 -0.355648 -0.302955 -0.563263 -0.386911 0.385501 -0.672956 -0.795428 -0.819672 0.210782 0.210666 0.238380 0.248119 0.244284 0.242403 0.220563 0.218950 0.226088 0.221479 0.234459 0.225597 0.226699 0.225950 0.247649
chargesum: 0.00000
title: Mulliken charges with hydrogens summed into heavy atoms:
elementType: N C C C C C C C C C C C
charge: -0.051556 0.502245 -0.111102 0.151126 -0.117268 -0.054837 -0.318979 -0.144509 0.385501 -0.007355 -0.113893 -0.119373
polarizability: 2.16060352e+02 -7.46522970e+00 1.16353340e+02 -4.39408464e+00 -5.42695865e+00 7.61481854e+01
1716.lowfreq: -4.8263 -0.0006 0.0002 0.0007 1.3514 11.5168 33.9716 36.5379 61.7912
frequency: 33.5606 36.5286 61.7303 119.1936 146.5103 189.7576 195.4234 217.2971 252.1282 297.3159 311.1200 358.5207 398.2637 409.3354 460.7308 480.8880 540.0168 589.6368 640.9345 737.8443 773.8122 783.9177 809.9071 843.4443 859.1355 887.5200 934.1815 962.2013 963.3909 974.0079 987.4540 1003.8885 1049.3431 1056.2609 1063.3778 1078.1263 1136.1289 1182.6739 1225.9826 1239.8976 1255.1453 1294.4969 1315.2695 1321.1508 1356.5325 1378.7549 1386.0785 1390.0542 1396.6714 1456.9627 1461.6909 1467.0190 1471.0400 1472.8746 1473.3047 1486.0544 1487.9088 1547.9551 1589.3806 1664.2050 2956.8099 2962.5392 2980.5415 2984.1807 3027.9454 3036.2281 3043.0020 3079.2448 3080.9035 3085.1624 3087.3277 3101.7706 3117.5040 3119.8959 3179.7131
redmass: 2.3771 2.9131 3.3162 2.5518 2.8883 1.1766 1.2741 1.3060 2.3437 2.3546 3.3863 2.4034 3.1776 3.2621 2.7960 3.0762 2.8698 3.3174 6.7508 4.1516 3.4681 1.1933 3.7458 1.4061 2.9709 1.7247 1.4000 1.3868 2.5641 1.3518 1.2820 2.6932 1.5487 1.5439 1.9955 1.6728 1.4754 1.8153 2.6343 1.5124 1.9748 1.7285 1.5313 5.6475 1.5855 1.9552 1.2702 1.1975 1.2276 1.1918 1.5252 1.1283 1.0829 1.1666 1.0616 1.0760 1.1069 5.0841 6.1236 6.7074 1.0378 1.0401 1.0356 1.0594 1.0965 1.1013 1.0927 1.1001 1.0992 1.1011 1.0981 1.0911 1.0888 1.0907 1.0938
irintensity: 0.0702 0.0760 2.1179 1.1048 0.2688 0.5413 0.3399 1.0096 0.1052 1.3106 0.2188 2.4813 1.9980 0.5987 0.4779 4.1924 12.0038 7.7256 1.8033 0.3832 0.8719 3.4723 2.5120 14.3870 4.7633 24.5348 8.1846 0.4213 5.2615 0.2227 12.6224 4.9542 3.7201 12.1493 25.3225 7.9658 3.3220 3.5200 0.8620 0.6247 0.8422 5.3340 4.8466 1.7488 0.4662 17.4514 25.3305 9.0418 9.8951 9.1691 36.2584 8.3396 27.8960 28.7827 15.9914 15.6475 18.4042 17.0916 16.4304 64.2416 37.5725 45.6217 40.6730 42.3205 23.1426 8.4858 30.6686 64.4571 18.9096 37.0455 29.1259 40.8312 23.7540 12.3571 11.1776
temp: 298.150 k
press: 1.00000 atm
elementType: 7 6 6 6 6 6 6 6 6 6 6 6 1 1 1 1 1 1 1 1 1 1 1 1 1 1 1
symmnumber: 1
zpe: 602958.0 jmol-1
zpe.correction: 0.229655 hartree
zpe.thermalcorrener: 0.242432 hartree
zpe.thermalcorrenthalpy: 0.243376 hartree
zpe.thermalcorrgfe: 0.189606 hartree
zpe.sumelectzpe: -482.008348 hartree
zpe.sumelectthermal: -481.995571 hartree
zpe.sumelectthermalent: -481.994627 hartree
zpe.sumelectthermalfe: -482.048397 hartree
dipole: 0.3666 2.5596 -0.3791
dipole: 2.6133
quadrupole: -58.5242 -73.1445 -75.9255
quadrupole: -1.8597 -0.7074 -0.9192
quadrupole: 10.6738 -3.9464 -6.7274 -1.8597 -0.7074 -0.9192
hfenergy: -482.2380029 hartree
pointgroup: C01 [X(C11H15N1)]
dipole: 0.1725245 0.551344 -0.8505166 debye
polarizability: 215.6810704|-8.8282379|88.4392639|5.5967137|-19.5104473|104.4415424 unknown
InChI: InChI=1S/C11H15N/c1-4-10-5-6-11(12-8-10)7-9(2)3/h5-8H,4H2,1-3H3
charge 0 multiplicity 1
27 atoms
N  0.197784 -0.861065 1.22111
C  2.226405 -0.264917 -0.040741
C  3.742378 -0.207251 -0.102806
C  -0.593439 -0.335089 0.216282
C  1.406707 0.233318 -1.084862
C  0.00325 0.196734 -0.965891
C  1.54866 -0.813639 1.079863
C  -2.041986 -0.437245 0.475982
C  -3.089603 0.265737 -0.062071
C  4.29998 1.187291 0.292497
C  -4.510977 -0.046554 0.373367
C  -2.967104 1.392808 -1.0751
H  4.171316 -0.97228 0.572447
H  4.086338 -0.455962 -1.125769
H  1.866836 0.633983 -1.996826
H  -0.621027 0.537815 -1.794269
H  2.126087 -1.249837 1.906548
H  -2.267882 -1.1734 1.258757
H  3.910938 1.974228 -0.378977
H  5.403791 1.200352 0.234351
H  4.005148 1.450753 1.324174
H  -5.147204 -0.286674 -0.50231
H  -4.552321 -0.898944 1.072324
H  -4.974554 0.830908 0.867359
H  -3.81747 2.092003 -0.975016
H  -2.990426 1.009564 -2.115789
H  -2.034025 1.968658 -0.950532
