program: Gaussian 09
title: 000247890
version: EM64L-G09RevD.01
frameworkgroup: C1[X(C14H18Cl2N2O3)]
method: RPBEPBE
basis: SDD
operation: Freq
keyword: #p
keyword: freq=noraman
keyword: PBEPBE/SDD
title: #p freq=noraman PBEPBE/SDD
converged: YES YES NO NO
title: Mulliken charges:
elementType: Cl Cl O O O N N C C C C C C C C C C C C C C H H H H H H H H H H H H H H H H H H
charge: -0.039982 -0.055370 -0.289429 -0.288669 -0.263695 -0.182425 -0.496055 -0.408232 -0.323541 0.286119 -0.569359 -0.576282 0.486852 -0.452094 -0.325521 0.237116 -0.338367 -0.338854 0.177499 -0.219470 -0.674546 0.237061 0.265808 0.280100 0.232697 0.274765 0.278606 0.255813 0.308029 0.318209 0.222068 0.310780 0.271170 0.270289 0.228253 0.229035 0.229888 0.229972 0.211761
chargesum: 0.00000
title: Mulliken charges with hydrogens summed into heavy atoms:
elementType: Cl Cl O O O N N C C C C C C C C C C C C C C
charge: -0.039982 -0.055370 -0.289429 -0.288669 -0.263695 -0.182425 -0.177846 0.094637 0.189256 0.286119 -0.015988 -0.012440 0.486852 -0.230026 -0.014741 0.237116 -0.067197 -0.068565 0.177499 0.237818 -0.002925
polarizability: 3.30129080e+02 3.29047751e+00 2.10337094e+02 -2.03297162e+00 -2.01171999e+01 1.11070936e+02
1716.lowfreq: -10.3768 -5.0486 -3.2306 -0.0013 -0.0013 -0.0006 9.9486 21.4761 27.4842
frequency: 4.4024 21.4123 27.4473 28.8805 36.7435 61.6320 68.5576 72.4450 81.8350 92.3908 98.8145 115.5170 136.0899 163.1105 179.3282 209.7416 224.3540 242.8755 246.2778 255.6746 302.8914 319.0067 344.9408 364.8055 393.2811 407.8959 413.3860 480.2197 504.4657 516.8773 572.2847 607.9004 635.0888 656.4995 679.7283 690.5680 696.2517 713.9727 757.6087 774.8605 785.5771 792.2474 797.6675 833.9943 838.6428 850.9907 867.4624 880.4694 980.4453 988.3820 1000.2662 1003.9996 1007.5558 1023.5382 1034.9113 1046.4291 1062.1991 1071.0281 1112.4260 1122.2232 1123.5193 1136.1945 1166.7866 1183.9551 1234.7147 1248.7676 1250.4658 1252.1484 1257.3759 1263.5441 1268.3431 1302.2467 1306.9746 1343.6875 1357.7582 1359.6730 1364.6808 1387.3596 1398.8645 1423.5232 1449.5914 1457.7809 1462.9420 1465.9181 1473.7142 1486.7995 1491.5854 1506.2689 1513.4621 1586.5302 1611.5075 1617.6266 1626.4538 2995.0409 3002.2215 3008.4140 3029.3150 3060.1358 3060.6501 3066.1086 3068.1913 3091.6668 3100.4404 3106.4742 3111.4715 3144.0857 3154.3800 3163.0539 3171.6081 3202.0850 3543.1544
redmass: 4.0549 6.2189 10.3490 11.8745 3.4955 4.3568 4.4762 5.2716 2.9618 4.8415 2.9131 3.1846 3.9231 3.5980 9.3588 4.3739 4.4432 6.1622 1.2765 5.4822 4.4365 5.0334 3.7375 5.0033 5.3260 3.8720 3.0192 5.1302 2.4148 4.6417 1.3931 5.7566 7.0902 7.1512 4.2645 6.0585 6.0156 6.4293 4.4357 1.2543 1.3639 2.8954 1.1078 4.1098 1.4156 4.9319 5.7699 1.4848 1.3595 1.9291 1.5313 3.1757 1.3308 2.2753 4.3987 2.9422 2.9454 2.8485 2.2118 1.3633 1.3429 1.4696 2.0412 1.1585 2.3997 1.1652 2.4352 1.2723 1.2727 1.4350 1.6719 1.3925 1.4218 1.4194 1.5156 1.4712 1.5844 2.6161 1.2718 4.5260 1.0884 1.0967 1.0407 1.0966 1.0597 1.0769 1.6673 2.2528 1.5599 5.3989 6.8992 5.4775 6.8005 1.0357 1.0646 1.0581 1.0617 1.0592 1.0586 1.1065 1.0968 1.0985 1.1032 1.1025 1.0900 1.1117 1.1113 1.0945 1.0907 1.0952 1.0754
irintensity: 0.2060 0.3355 0.7164 0.3463 0.3842 1.5579 2.1928 6.2275 2.1916 5.6996 1.7029 2.4011 1.7378 1.7990 1.3752 1.7061 9.4729 4.5489 0.2851 2.9608 2.5057 5.2254 17.0352 9.2706 19.1743 9.1576 0.4191 8.7233 39.3495 6.1385 34.4735 17.5619 5.2791 21.7986 30.6549 29.0006 27.4743 64.6500 17.0757 4.9684 14.5755 4.3379 2.0298 1.3906 25.2838 6.9011 2.1333 50.1604 0.3202 25.4919 3.4240 22.1009 1.1258 32.4938 0.8019 4.9972 174.1675 296.9260 3.1800 17.8892 32.8633 5.6481 226.7150 167.2426 23.3272 20.0958 391.3632 89.6998 80.2764 94.4797 23.3287 18.8912 71.1052 15.4046 11.9520 8.0653 32.9954 239.6577 20.3406 28.8492 19.5128 14.1467 12.1507 30.9325 7.4036 8.6599 493.9646 151.7882 342.3888 13.9484 292.2214 75.9698 267.6161 22.7405 15.9091 24.6283 15.2495 1.7583 28.3252 9.0005 12.7961 34.2026 2.2316 45.2443 20.2677 14.4366 6.8964 4.0747 1.0760 4.6369 12.6179
temp: 298.150 k
press: 1.00000 atm
elementType: 17 17 8 8 8 7 7 6 6 6 6 6 6 6 6 6 6 6 6 6 6 1 1 1 1 1 1 1 1 1 1 1 1 1 1 1 1 1 1
symmnumber: 1
zpe: 800061.1 jmol-1
zpe.correction: 0.304727 hartree
zpe.thermalcorrener: 0.327412 hartree
zpe.thermalcorrenthalpy: 0.328356 hartree
zpe.thermalcorrgfe: 0.246036 hartree
zpe.sumelectzpe: -1798.032444 hartree
zpe.sumelectthermal: -1798.009759 hartree
zpe.sumelectthermalent: -1798.008814 hartree
zpe.sumelectthermalfe: -1798.091135 hartree
dipole: -0.9697 1.0978 -0.2406
dipole: 1.4844
quadrupole: -137.7268 -154.9736 -137.3349
quadrupole: -21.7532 4.1250 1.0732
quadrupole: 5.6183 -11.6285 6.0102 -21.7532 4.1250 1.0732
hfenergy: -1798.3371708 hartree
pointgroup: C01 [X(C14H18Cl2N2O3)]
dipole: -0.3798931 -0.4389904 0.0633904 debye
polarizability: 330.1580406|-3.2909329|212.900934|-0.3688602|-11.8827931|108.4781355 unknown
InChI: InChI=1S/C14H18Cl2N2O3/c1-2-21-13(19)11-3-5-12(6-4-11)17-14(20)18(9-7-15)10-8-16/h3-6,17H,2,7-10H2,1H3
charge 0 multiplicity 1
39 atoms
Cl -4.760941 -3.771022 -0.346134
Cl -6.190157 3.354468 0.647782
O  -1.883012 1.742104 -0.350138
O  5.029693 0.725095 -0.050982
O  5.109297 -1.559516 0.412592
N  -3.583586 0.191915 0.021271
N  -1.308144 -0.49358 0.1320
C  -4.081106 -1.151478 0.370407
C  -4.573523 1.260228 -0.254464
C  -2.222768 0.550128 -0.081838
C  -4.178244 -2.055843 -0.874945
C  -4.818317 2.107978 1.004875
C  0.110883 -0.416337 0.12855
C  0.817292 -1.626312 0.387542
C  0.837444 0.781301 -0.116313
C  2.951439 -0.449639 0.163046
C  2.219253 -1.641633 0.403915
C  2.244265 0.752308 -0.095509
C  4.436171 -0.518654 0.193619
C  6.522689 0.743899 -0.036925
C  6.948002 2.187369 -0.285226
H  -3.451526 -1.629326 1.145125
H  -5.08331 -1.053603 0.822499
H  -4.193435 1.908605 -1.06027
H  -5.517009 0.795318 -0.59003
H  -3.209524 -2.205358 -1.375205
H  -4.92316 -1.688446 -1.595746
H  -5.173398 1.50966 1.857854
H  -3.930144 2.696832 1.271626
H  -1.676951 -1.425634 0.32502
H  0.26239 -2.554683 0.576818
H  0.29388 1.704882 -0.318425
H  2.771018 -2.566117 0.602036
H  2.80952 1.669679 -0.281957
H  6.885979 0.05356 -0.819935
H  6.866637 0.361631 0.941314
H  6.577829 2.546307 -1.260851
H  6.558495 2.854435 0.502754
H  8.051185 2.256778 -0.28535
