program: Gaussian 09
title: 000248006
version: EM64L-G09RevD.01
frameworkgroup: C1[X(C22H20N6O2S)]
method: RPBEPBE
basis: SDD
operation: Freq
keyword: #p
keyword: freq=noraman
keyword: PBEPBE/SDD
title: #p freq=noraman PBEPBE/SDD
converged: YES YES NO NO
title: Mulliken charges:
elementType: S O O N N N N N N C C C C C C C C C C C C C C C C C C C C C C H H H H H H H H H H H H H H H H H H H H
charge: 0.196221 -0.204425 -0.297375 -0.387638 -0.347604 0.040750 0.041873 -0.016207 -0.011147 -0.514596 -0.543125 -0.650965 -0.690426 0.287549 0.336620 0.468701 0.458358 -0.397601 -0.368070 -0.502652 -0.520360 -0.386887 -0.334184 0.399605 0.399941 -0.230054 -0.189696 -0.377061 -0.371431 -0.254639 -0.256093 0.284805 0.305909 0.227997 0.224681 0.258723 0.265409 0.238061 0.214175 0.355506 0.308828 0.231099 0.214557 0.308149 0.254290 0.239103 0.277520 0.240211 0.247935 0.261759 0.263902
chargesum: 0.00000
title: Mulliken charges with hydrogens summed into heavy atoms:
elementType: S O O N N N N N N C C C C C C C C C C C C C C C C C C C C C C
charge: 0.196221 -0.204425 -0.297375 -0.032132 -0.038775 0.040750 0.041873 -0.016207 -0.011147 -0.229791 -0.237216 0.060436 0.027220 0.287549 0.336620 0.468701 0.458358 -0.166502 -0.153514 -0.194503 -0.266070 -0.147784 -0.056664 0.399605 0.399941 0.010157 0.058238 -0.115302 -0.107529 -0.254639 -0.256093
polarizability: 5.15239400e+02 9.50395291e+00 3.37843321e+02 4.99226836e+00 -6.88891148e+00 2.20220356e+02
1716.lowfreq: -5.3217 -0.0893 -0.0009 -0.0002 0.0011 1.9328 6.6520 17.1234 17.9198
frequency: 5.8450 17.0155 17.8124 26.6463 33.3483 41.0717 47.8533 55.6495 71.5451 78.6342 112.4928 122.2567 131.9264 133.3674 145.0308 148.6874 157.1846 166.4452 173.1174 197.9920 212.7645 220.3019 236.1992 239.9514 249.1663 256.0857 260.2008 274.9981 291.3544 315.0381 330.6786 340.0466 358.5545 383.7989 384.3183 410.8619 423.5439 452.5175 458.0956 475.7670 479.1123 486.8072 494.4235 555.0798 558.8313 559.5530 584.3855 618.2339 627.7771 628.3968 640.6770 642.1707 664.3813 673.6687 696.2056 698.6932 712.5581 727.1688 736.1883 754.2568 810.0818 818.6279 826.1311 888.2811 903.9165 905.3614 918.0752 943.7056 944.0611 948.6818 955.0535 963.0393 966.8261 983.9062 985.8940 989.9063 993.9094 997.6084 1008.3221 1026.1264 1040.1881 1068.9033 1088.2107 1092.6108 1095.5365 1097.4474 1122.1015 1148.1626 1171.4514 1176.5447 1182.7949 1184.3886 1189.3905 1223.8623 1251.2450 1261.2068 1263.2245 1296.6120 1298.8499 1311.8611 1317.5688 1340.3350 1353.1135 1382.3801 1384.4409 1393.2702 1399.1465 1417.6258 1429.3305 1456.6875 1465.5479 1465.6165 1470.8155 1475.9308 1487.6090 1520.0589 1545.9348 1566.2167 1571.7656 1588.9924 1591.2108 1594.2217 1608.3610 1610.0203 1647.7721 2182.5414 2182.6698 2978.7327 2979.4544 2994.6920 3002.0220 3042.2193 3060.2891 3078.6583 3090.0932 3100.1679 3116.7902 3118.8677 3142.0490 3147.1566 3149.2341 3167.3310 3167.8902 3170.6981 3179.1676 3190.9582 3398.5251
redmass: 9.0346 6.8286 6.3135 6.7475 6.2152 6.6652 7.0868 5.4547 6.1194 6.2149 4.9912 6.6327 6.4851 7.1601 5.7487 4.8876 6.5761 4.8729 6.1772 3.9308 2.2469 2.3100 2.2319 3.5698 4.0348 2.6365 1.3560 3.8929 4.2502 4.5546 4.7907 5.4245 5.0430 4.5047 4.2519 6.5138 7.8963 7.9774 7.6892 4.4471 4.8432 4.0095 6.2544 7.1496 6.2573 6.5153 4.6847 3.5385 4.8421 5.4704 6.0008 1.5412 4.7747 4.0429 1.9030 1.9307 6.1119 5.9087 5.5173 6.3048 1.3337 1.3783 1.4776 4.1871 3.5679 1.5250 1.3918 2.5879 1.4211 1.4697 1.6503 2.5316 1.7608 5.2662 5.2794 1.6050 1.3921 1.8955 1.3776 1.9963 3.7881 1.5852 2.7697 1.8216 1.9844 2.5194 3.0516 1.9863 1.7779 1.8863 1.1128 1.0998 1.7094 1.3524 1.9380 2.2006 2.2511 1.3539 1.3865 1.4778 1.6584 1.6008 1.7714 7.0879 5.7168 1.1989 1.1969 3.1535 3.3652 1.0425 2.1692 1.1189 1.0485 2.4121 1.1399 1.7489 2.3137 3.5040 5.5947 6.3151 3.8616 5.8669 6.1826 5.7752 4.8839 12.6329 12.6331 1.0841 1.0412 1.0369 1.0881 1.0861 1.0935 1.0920 1.0974 1.0979 1.1013 1.0888 1.0926 1.0911 1.0877 1.0939 1.0933 1.0981 1.0987 1.0827 1.0754
irintensity: 2.9097 0.3763 1.5891 0.2940 1.6901 2.8581 1.6679 5.3710 1.7512 1.7647 2.3477 4.0890 0.3996 5.3805 3.2752 1.9600 8.4558 3.9086 10.8385 13.9755 5.5879 1.6955 6.6054 2.1250 1.3810 17.4099 1.1583 1.8742 13.3893 7.5477 4.1272 9.0979 13.8551 0.0685 0.0577 2.3361 0.0800 1.0503 1.9660 5.0956 4.0728 6.0416 8.7594 0.3011 3.8525 5.1226 0.8719 7.7901 10.1724 1.5444 4.4759 56.1875 6.8185 6.6399 30.0023 30.3388 19.2718 4.2235 5.2888 8.3867 199.2845 30.6308 28.5906 6.0581 11.7168 2.0349 10.3309 36.0873 14.7886 21.0681 38.3149 38.5419 48.7118 4.2636 0.8524 43.5217 4.8534 7.5264 1.4138 8.8301 8.3566 26.0867 3.6687 39.4834 6.4674 108.3597 18.0310 97.9693 5.7478 214.6180 8.5410 1.2388 51.5774 73.1975 66.3352 22.6732 74.6896 3.4877 5.8505 6.5207 51.3375 23.4726 4.2067 1.7260 1.3385 33.9986 23.5128 6.9567 10.0613 12.9245 15.7168 15.4422 21.1804 45.2120 49.1327 211.0607 301.1887 39.9446 17.0270 102.7090 4.3350 168.9407 1.8933 6.3114 205.7701 29.5035 28.4173 32.4139 31.3410 24.3457 29.4528 4.8235 6.0951 21.6306 17.0649 17.6717 11.1687 8.7869 3.1588 11.2476 2.3493 0.2942 1.1963 9.7682 4.0707 245.0661 5.3518
temp: 298.150 k
press: 1.00000 atm
elementType: 16 8 8 7 7 7 7 7 7 6 6 6 6 6 6 6 6 6 6 6 6 6 6 6 6 6 6 6 6 6 6 1 1 1 1 1 1 1 1 1 1 1 1 1 1 1 1 1 1 1 1
symmnumber: 1
zpe: 999258.8 jmol-1
zpe.correction: 0.380598 hartree
zpe.thermalcorrener: 0.410886 hartree
zpe.thermalcorrenthalpy: 0.411830 hartree
zpe.thermalcorrgfe: 0.314389 hartree
zpe.sumelectzpe: -1725.101590 hartree
zpe.sumelectthermal: -1725.071302 hartree
zpe.sumelectthermalent: -1725.070358 hartree
zpe.sumelectthermalfe: -1725.167799 hartree
dipole: -4.2321 -7.6471 6.4500
dipole: 10.8624
quadrupole: -189.0071 -219.3171 -202.4115
quadrupole: 33.5611 12.6058 20.8554
quadrupole: 14.5715 -15.7386 1.1671 33.5611 12.6058 20.8554
hfenergy: -1725.482188 hartree
pointgroup: C01 [X(C22H20N6O2S1)]
dipole: 2.384994 3.2993996 1.2997391 debye
polarizability: 508.0067402|-34.1364621|329.8145918|12.8334457|-41.6653817|235.4817453 unknown
InChI: InChI=1S/C22H20N6O2S/c1-15(21(29)27-25-13-19-7-3-5-17(9-19)11-23)31-16(2)22(30)28-26-14-20-8-4-6-18(10-20)12-24/h3-10,13-16,27-28H,1-2H3
charge 0 multiplicity 1
51 atoms
S  4.883544 -0.750983 -0.693876
O  3.058121 -3.707545 0.074806
O  2.909058 0.791289 1.663235
N  2.217284 -1.882159 1.309367
N  2.576598 1.867887 -0.388097
N  0.901651 -2.297063 1.266962
N  1.198533 1.923343 -0.239838
N  -4.216704 -5.482782 0.085098
N  -4.295095 5.041997 -3.800333
C  4.61455 -1.947693 0.81121
C  4.818663 0.975065 0.158744
C  5.741079 -2.987389 0.825146
C  5.483739 1.985704 -0.791632
C  3.229378 -2.618028 0.677552
C  3.365585 1.223169 0.55848
C  -1.406161 -1.840882 1.851568
C  -0.941073 2.620223 -1.136935
C  0.020536 -1.494243 1.833119
C  0.526418 2.569592 -1.169425
C  -1.898523 -3.015032 1.219327
C  -1.623428 3.440476 -2.069807
C  -2.3210 -0.976955 2.516239
C  -1.693824 1.847575 -0.206053
C  -3.281778 -3.312305 1.256244
C  -3.041522 3.499451 -2.068194
C  -3.699764 -1.278669 2.554546
C  -3.10001 1.901477 -0.211856
C  -4.190404 -2.441347 1.927429
C  -3.783293 2.724775 -1.134612
C  -3.786042 -4.5011 0.614752
C  -3.727049 4.34135 -3.015283
H  4.651418 -1.288829 1.696779
H  5.39584 0.886317 1.09297
H  5.631608 -3.645639 1.707056
H  6.727863 -2.497071 0.864075
H  5.685297 -3.627587 -0.070637
H  6.552869 1.740141 -0.902381
H  5.406735 3.01224 -0.388087
H  5.047946 1.968453 -1.809167
H  2.455398 -0.945816 1.70093
H  3.024808 2.218357 -1.247595
H  0.310785 -0.538648 2.310937
H  1.025055 3.08757 -2.013991
H  -1.192627 -3.677295 0.709085
H  -1.06205 4.036401 -2.798475
H  -1.944408 -0.075473 3.01628
H  -1.157695 1.201841 0.495308
H  -4.391344 -0.613126 3.081908
H  -3.668661 1.289018 0.495247
H  -5.256718 -2.685955 1.952222
H  -4.876686 2.766802 -1.144949
