program: Gaussian 09
title: 000247871
version: EM64L-G09RevD.01
frameworkgroup: C1[X(C12H17N)]
method: RPBEPBE
basis: SDD
operation: Freq
keyword: #pfreq=noraman
keyword: PBEPBE/SDD
title: #p freq=noraman PBEPBE/SDD
converged: YES YES NO NO
title: Mulliken charges:
elementType: N C C C C C C C C C C C C H H H H H H H H H H H H H H H H H
charge: -0.056889 0.424477 -0.524395 0.503503 -0.533663 0.165057 -0.409733 -0.355513 -0.306294 -0.568288 -0.838762 -0.672186 -0.672918 0.205707 0.221680 0.210630 0.210725 0.245059 0.237859 0.244759 0.244308 0.228970 0.230466 0.241050 0.209349 0.218968 0.230767 0.220458 0.218836 0.226014
chargesum: 0.00000
title: Mulliken charges with hydrogens summed into heavy atoms:
elementType: N C C C C C C C C C C C C
charge: -0.056889 0.424477 -0.097008 0.503503 -0.112308 0.165057 -0.164675 -0.117654 -0.061535 -0.323980 -0.138275 -0.013102 -0.007611
polarizability: 2.35788586e+02 -7.15000574e+00 1.26170167e+02 -8.49278595e-02 -1.70459027e+00 8.58114738e+01
1716.lowfreq: -23.5370 -10.3116 -0.0006 -0.0006 -0.0003 5.2570 15.2557 28.1792 41.2581
frequency: -12.8987 27.0743 40.8202 72.9030 129.8815 135.6426 190.3342 198.1674 219.0988 230.8767 281.2986 303.0583 309.3878 361.6421 405.1488 423.5975 478.4272 520.5149 557.9493 591.9187 641.7988 738.6313 773.0120 781.9234 788.7376 797.7474 839.1625 849.1879 910.5112 934.6529 958.6186 964.6449 972.9923 999.1826 1002.8651 1013.0754 1048.9710 1061.6755 1065.8065 1087.4455 1137.1398 1181.0919 1225.0428 1238.1641 1244.9956 1251.4572 1298.0045 1311.3669 1313.9797 1323.5727 1364.1910 1379.6137 1384.7670 1385.4700 1392.0104 1463.0778 1465.7363 1467.7160 1470.9744 1473.0368 1479.4641 1483.4855 1487.9431 1488.4820 1548.2559 1589.5238 1654.5474 2963.6217 2967.9140 2979.7522 2979.9778 2983.5591 3035.1854 3038.2656 3045.8528 3074.6983 3078.8032 3078.9920 3084.5716 3086.1480 3100.7109 3110.8569 3121.0167 3189.2151
redmass: 2.3365 2.8024 3.6293 2.9474 2.6845 2.8020 1.6158 1.1538 1.2577 1.6828 2.8104 2.8358 2.8176 2.5524 3.1444 3.1454 3.2566 3.5628 2.2756 3.3589 6.1880 3.8995 2.6591 1.2577 1.3857 3.0681 1.9711 2.0385 1.5056 1.4048 2.1234 2.3558 1.3587 1.3611 2.7230 1.8465 1.5572 2.0180 1.8573 1.5848 1.5017 1.7018 2.7039 1.5839 1.2379 1.6660 1.6208 1.5432 1.5345 5.2062 1.4675 1.8826 1.2904 1.1982 1.2368 2.4831 1.0528 1.0641 1.0569 1.0923 1.0532 1.0756 1.1008 1.0719 4.9713 6.1123 7.4307 1.0435 1.0591 1.0352 1.0355 1.0594 1.1014 1.0975 1.0935 1.0994 1.0997 1.0993 1.1010 1.1010 1.0911 1.0886 1.0909 1.0931
irintensity: 0.0396 0.3963 1.8707 0.1767 0.4524 0.5102 0.6677 0.0570 0.7801 0.1319 1.0742 0.3875 0.6273 2.2158 1.7056 0.1881 2.1612 0.9764 17.3148 5.9212 1.4397 0.1291 1.8458 2.3022 5.2088 2.2647 13.5300 14.5485 21.5090 11.0324 5.2838 2.8017 0.0610 8.2762 6.2597 3.4305 1.6749 16.8596 21.2228 4.4906 3.0054 1.9840 0.5126 0.3071 0.7048 1.3312 3.8435 2.0108 5.0063 1.7288 0.9983 16.9353 13.4335 10.3723 15.8062 64.3213 6.7727 7.6149 14.6289 9.9172 27.3374 2.1148 14.9509 19.0333 18.2229 19.3738 64.9562 18.7947 47.2377 40.4930 52.1032 40.5717 8.4309 9.0633 20.9944 67.6713 75.6880 1.6928 37.3814 55.8000 41.6410 18.9335 17.8203 10.0084
temp: 298.150 k
press: 1.00000 atm
elementType: 7 6 6 6 6 6 6 6 6 6 6 6 6 1 1 1 1 1 1 1 1 1 1 1 1 1 1 1 1 1
symmnumber: 1
zpe: 676671.5 jmol-1
zpe.correction: 0.257731 hartree
zpe.thermalcorrener: 0.271017 hartree
zpe.thermalcorrenthalpy: 0.271961 hartree
zpe.thermalcorrgfe: 0.217013 hartree
zpe.sumelectzpe: -521.230236 hartree
zpe.sumelectthermal: -521.216950 hartree
zpe.sumelectthermalent: -521.216005 hartree
zpe.sumelectthermalfe: -521.270954 hartree
dipole: 0.4023 2.5042 0.0748
dipole: 2.5374
quadrupole: -64.4960 -78.8034 -83.0445
quadrupole: -0.6570 0.2245 -1.0986
quadrupole: 10.9519 -3.3554 -7.5965 -0.6570 0.2245 -1.0986
hfenergy: -521.4879667 hartree
pointgroup: C01 [X(C12H17N1)]
dipole: 0.1810591 0.4631598 0.8656282 debye
polarizability: 235.3970532|-4.9752836|97.4168839|-8.3119582|18.471512|114.9562891 unknown
InChI: InChI=1S/C12H17N/c1-4-10(3)8-12-7-6-11(5-2)9-13-12/h6-9H,4-5H2,1-3H3
charge 0 multiplicity 1
30 atoms
N  0.589278 -0.585828 -1.360479
C  -2.681521 0.311154 0.159528
C  -4.100233 0.073649 -0.348587
C  2.661261 0.123359 -0.236134
C  4.175883 0.059079 -0.152507
C  -0.167032 0.102024 -0.427327
C  -1.620064 0.000384 -0.652973
C  1.881085 0.852084 0.696742
C  0.475122 0.848909 0.606109
C  1.943089 -0.56515 -1.249122
C  -2.578196 0.85909 1.574858
C  -4.78015 -1.158558 0.309249
C  4.668314 -0.977801 0.893689
H  -4.718572 0.972387 -0.143627
H  -4.087532 -0.065861 -1.445373
H  4.591803 -0.20308 -1.144254
H  4.581182 1.055908 0.109571
H  -1.844728 -0.432631 -1.637276
H  2.375017 1.432035 1.486449
H  -0.111717 1.442806 1.308432
H  2.489739 -1.12512 -2.020309
H  -2.343127 1.942483 1.572117
H  -3.535758 0.739917 2.111428
H  -1.794623 0.350926 2.165506
H  -4.818904 -1.063249 1.410164
H  -5.817382 -1.273683 -0.055531
H  -4.223364 -2.081716 0.069206
H  4.290769 -0.73152 1.902761
H  5.772673 -1.000666 0.935386
H  4.310687 -1.991834 0.639905
