program: Gaussian 09
title: 000247873
version: EM64L-G09RevD.01
frameworkgroup: C1[X(C13H19N)]
method: RPBEPBE
basis: SDD
operation: Freq
keyword: #pfreq=noraman
keyword: PBEPBE/SDD
title: #p freq=noraman PBEPBE/SDD
converged: YES YES NO NO
title: Mulliken charges:
elementType: N C C C C C C C C C C C C C H H H H H H H H H H H H H H H H H H H
charge: -0.053872 -0.217148 0.456561 -0.702784 -0.694373 -0.441152 -0.852588 0.160545 0.500854 -0.533513 -0.312876 -0.353921 -0.567119 -0.673121 0.216392 0.215176 0.227723 0.212684 0.232499 0.216000 0.200539 0.244908 0.227435 0.244581 0.228855 0.210706 0.210724 0.248104 0.238107 0.244503 0.226087 0.218896 0.220589
chargesum: 0.00000
title: Mulliken charges with hydrogens summed into heavy atoms:
elementType: N C C C C C C C C C C C C C
charge: -0.053872 -0.000756 0.456561 -0.047201 -0.045335 -0.196244 -0.151717 0.160545 0.500854 -0.112084 -0.064772 -0.115815 -0.322616 -0.007549
polarizability: 2.51611353e+02 6.73630393e+00 1.33938503e+02 3.19141656e+00 -1.30075202e+00 9.77228301e+01
1716.lowfreq: -22.7758 -3.1540 0.0004 0.0006 0.0007 8.7239 16.6706 33.1040 44.6100
frequency: -12.5150 32.9885 44.1916 66.3867 115.1019 132.7174 184.6567 197.6784 203.5836 222.3006 238.1470 245.1977 269.8212 303.8647 308.2504 366.3495 400.4807 407.0478 446.6237 524.7832 548.6083 561.3255 590.7333 641.5746 734.8769 761.5120 782.2114 786.5564 823.6386 847.6815 899.3317 910.5921 919.8587 934.5758 953.0909 962.5488 972.6106 978.4783 1004.0211 1021.5096 1049.2496 1062.6913 1076.2097 1105.5086 1139.2907 1149.4310 1195.2608 1224.8118 1238.5817 1251.5004 1297.2088 1307.4355 1308.8936 1313.9032 1324.4759 1371.2951 1374.1112 1380.1596 1385.7539 1390.9251 1396.4653 1459.4755 1463.5831 1467.9483 1471.6783 1473.4993 1474.7232 1480.9197 1484.7600 1488.3776 1494.0216 1547.8109 1589.4583 1649.0571 2966.6296 2972.9608 2976.1089 2979.7874 2983.3521 2990.1777 3035.2915 3049.1450 3064.6543 3071.3868 3075.4028 3078.8421 3081.0434 3084.3301 3084.5244 3101.5021 3108.9938 3121.4432 3185.6918
redmass: 2.4549 3.1184 3.4710 3.1286 2.6998 3.0087 1.8293 1.2183 1.2265 1.1596 2.6339 1.4332 2.7901 2.4108 2.5578 2.6166 2.7520 3.1737 4.3479 3.3843 2.6453 2.3882 3.0311 5.8820 4.3097 2.9299 1.3054 3.0157 4.1038 1.4873 1.6419 2.0148 1.2373 1.4028 1.3960 2.5245 1.4539 1.5631 2.6989 1.5259 1.5537 2.0008 1.5696 2.5306 1.4489 1.9257 1.6326 2.6151 1.5375 1.7465 1.8096 1.6181 1.4779 1.5427 3.8812 1.3873 1.1983 1.6785 1.1989 1.3873 1.2295 1.0843 2.2569 1.0465 1.0544 1.0858 1.0677 1.0570 1.0648 1.1017 1.0627 5.0061 6.0990 7.4553 1.0412 1.0347 1.0352 1.0354 1.0594 1.0847 1.1013 1.0914 1.0994 1.0987 1.1004 1.1002 1.1000 1.1011 1.0986 1.0911 1.0883 1.0908 1.0934
irintensity: 0.0444 0.0473 1.8946 0.2325 1.0306 0.1260 0.2107 0.2847 0.1498 0.6317 0.2210 0.1171 0.4455 0.8607 0.6629 1.7429 0.2090 1.7872 0.4265 4.9835 3.9866 10.5751 8.2144 0.9803 0.2978 1.1910 3.0842 0.7750 3.8566 19.1041 8.7209 16.9961 10.0462 11.3144 0.3609 7.0628 0.6041 0.3272 6.3853 7.0504 3.1085 18.7592 46.2074 1.5519 5.0904 0.0436 5.6751 0.8197 0.5823 2.4609 2.1866 5.5060 4.1035 5.5397 1.1468 7.9635 18.0488 19.6432 9.5262 5.1041 15.0379 0.6932 72.9223 0.5766 15.2628 11.3769 2.5494 21.1046 5.8327 16.7161 27.7389 17.8776 20.0953 65.5432 18.4308 35.0945 53.7633 40.6952 42.5497 11.5538 8.3632 19.8696 0.1299 102.6555 28.0397 63.3436 14.8112 38.3539 55.5596 41.9721 19.1612 18.3274 10.1569
temp: 298.150 k
press: 1.00000 atm
elementType: 7 6 6 6 6 6 6 6 6 6 6 6 6 6 1 1 1 1 1 1 1 1 1 1 1 1 1 1 1 1 1 1 1
symmnumber: 1
zpe: 749133.0 jmol-1
zpe.correction: 0.285330 hartree
zpe.thermalcorrener: 0.299992 hartree
zpe.thermalcorrenthalpy: 0.300937 hartree
zpe.thermalcorrgfe: 0.243437 hartree
zpe.sumelectzpe: -560.453808 hartree
zpe.sumelectthermal: -560.439145 hartree
zpe.sumelectthermalent: -560.438201 hartree
zpe.sumelectthermalfe: -560.495700 hartree
dipole: -0.3945 2.4419 0.0029
dipole: 2.4736
quadrupole: -70.9516 -85.6868 -89.4338
quadrupole: -0.9467 0.4973 -0.5528
quadrupole: 11.0724 -3.6627 -7.4098 -0.9467 0.4973 -0.5528
hfenergy: -560.7391377 hartree
pointgroup: C01 [X(C13H19N1)]
dipole: 0.1729002 -0.5888172 0.7553118 debye
polarizability: 251.3625691|3.876045|112.8591531|-8.2625|-18.0556097|119.0509643 unknown
InChI: InChI=1S/C13H19N/c1-5-12-6-7-13(14-9-12)8-11(4)10(2)3/h6-10H,5H2,1-4H3
charge 0 multiplicity 1
33 atoms
N  0.959986 0.805021 -1.203801
C  -3.753837 0.222306 -0.247278
C  -2.335578 -0.097381 0.242774
C  -4.650004 -1.045596 -0.275223
C  -4.419864 1.347564 0.592745
C  -1.272701 0.215479 -0.566833
C  -2.219167 -0.726762 1.622256
C  0.176997 0.026703 -0.370277
C  3.000519 -0.145665 -0.207535
C  4.516686 -0.162259 -0.127678
C  0.786213 -0.890407 0.538304
C  2.190826 -0.967966 0.61646
C  2.312101 0.710423 -1.106751
C  5.057839 0.684124 1.056767
H  -3.667657 0.594973 -1.287341
H  -5.651189 -0.79946 -0.675611
H  -4.208091 -1.832661 -0.912773
H  -4.790236 -1.463892 0.739103
H  -3.80123 2.262686 0.589529
H  -5.413129 1.598427 0.17593
H  -4.56992 1.038612 1.644347
H  -1.488241 0.729367 -1.513767
H  -2.140338 -1.830988 1.562795
H  -1.33322 -0.35863 2.168635
H  -3.109693 -0.504028 2.235184
H  4.875776 -1.204372 -0.019252
H  4.942991 0.224909 -1.07291
H  0.171797 -1.557637 1.145323
H  2.660566 -1.679034 1.307508
H  2.881113 1.349181 -1.796196
H  4.747344 1.739909 0.959568
H  6.162133 0.650098 1.092209
H  4.671005 0.307959 2.021285
