program: Gaussian 09
title: 000247869
version: EM64L-G09RevD.01
frameworkgroup: C1[X(C13H19N)]
method: RPBEPBE
basis: SDD
operation: Freq
keyword: #pfreq=noraman
keyword: PBEPBE/SDD
title: #p freq=noraman PBEPBE/SDD
converged: YES YES NO NO
title: Mulliken charges:
elementType: N C C C C C C C C C C C C C H H H H H H H H H H H H H H H H H H H
charge: -0.043984 0.512326 -0.543084 -0.537281 -0.455877 0.138759 0.497928 -0.532720 -0.693225 -0.711196 -0.311620 -0.355489 -0.563418 -0.673149 0.219097 0.217387 0.210461 0.236097 0.241121 0.210931 0.210757 0.217647 0.219520 0.227248 0.217975 0.217503 0.226794 0.250302 0.238957 0.244482 0.226156 0.219037 0.220557
chargesum: 0.00000
title: Mulliken charges with hydrogens summed into heavy atoms:
elementType: N C C C C C C C C C C C C C
charge: -0.043984 0.512326 -0.106599 -0.090722 -0.214756 0.138759 0.497928 -0.111032 -0.028810 -0.048923 -0.061318 -0.116532 -0.318936 -0.007400
polarizability: 2.44592149e+02 -4.28220976e+00 1.27679976e+02 2.52143512e-01 1.35444071e+01 1.06156720e+02
1716.lowfreq: -7.5033 -2.4778 -0.0009 -0.0008 -0.0007 10.3194 24.6039 33.1181 54.2285
frequency: 24.4191 33.0430 54.1700 66.6839 91.5453 133.6861 138.0450 194.0321 207.1153 214.5568 236.1371 259.2678 272.7440 310.8963 328.2069 365.4100 404.4108 438.5823 498.2114 548.3033 569.2748 588.4887 640.7650 721.9651 756.1900 775.9484 782.6429 784.0548 805.2106 841.6771 847.5206 891.3223 933.4305 944.9752 963.4902 972.0724 1003.0146 1010.1095 1034.3844 1049.5657 1053.6474 1062.9726 1086.1382 1092.2101 1137.0835 1189.0788 1220.9187 1237.9951 1246.8713 1250.8580 1264.5280 1290.8888 1314.3107 1315.6381 1316.4488 1329.3445 1369.0832 1379.6436 1383.6040 1388.4528 1391.6712 1460.9205 1463.0773 1469.1470 1472.2524 1472.9794 1476.0587 1481.3449 1484.5085 1487.9758 1493.8391 1546.1953 1588.5004 1647.3764 2952.1576 2978.7274 2979.9268 2980.0723 2982.5610 2983.7903 3034.6257 3036.4615 3045.8129 3076.0869 3078.1224 3078.9096 3081.3467 3084.5438 3085.6247 3101.5136 3104.4657 3120.1211 3168.4229
redmass: 2.8037 2.7779 3.6768 2.7695 2.5491 2.6472 2.5995 1.5414 1.2487 1.8173 1.5315 2.0857 2.8697 2.3462 2.1299 2.6929 3.3011 4.4743 2.8059 2.9116 2.4638 3.3313 6.2717 3.8938 2.9992 2.6516 1.2450 1.2025 1.5025 2.2171 1.7810 1.5642 1.4091 1.6945 2.6180 1.3530 2.4699 2.1672 2.2269 1.5472 1.8764 2.0009 1.7394 1.6529 1.4129 1.7488 2.7757 1.5696 1.2802 1.4066 1.3845 1.6321 1.5372 1.5228 3.6739 1.5518 1.5851 1.7206 1.2868 1.1981 1.2198 1.0872 2.2832 1.0911 1.0841 1.0620 1.0591 1.0504 1.0430 1.0974 1.0760 5.1351 6.1723 7.8902 1.0678 1.0516 1.0395 1.0396 1.0579 1.0379 1.1014 1.0986 1.0912 1.0995 1.0997 1.1002 1.1010 1.1010 1.0999 1.0912 1.0883 1.0902 1.0947
irintensity: 0.0434 0.0557 1.9720 0.2951 0.3464 0.4995 0.1172 0.1264 0.1078 0.2607 0.8425 0.3080 0.4096 0.4466 0.1836 2.5846 2.7669 0.5416 3.5897 1.8585 13.0947 7.1989 2.3551 0.9686 1.0011 0.4854 4.4711 3.0889 8.9174 11.5816 6.3531 36.8786 7.2729 14.7186 6.4890 0.1603 4.5577 2.3788 4.1738 1.2753 1.0869 21.4298 8.1239 19.2733 5.2055 0.4104 0.5488 0.3171 3.0460 2.8507 2.9024 3.3912 5.6158 0.7005 0.7907 0.6826 3.2120 21.1219 7.5793 9.3585 10.6077 3.3898 69.8104 14.5634 11.2777 12.3314 16.6106 8.9959 4.1277 18.5317 0.6576 16.2286 17.7970 66.4755 21.0062 32.3871 63.4905 15.4523 53.2817 44.1044 8.4671 12.1711 6.0206 73.3182 29.2705 60.7951 40.4450 37.9214 44.4027 42.3562 18.9983 18.8296 12.2126
temp: 298.150 k
press: 1.00000 atm
elementType: 7 6 6 6 6 6 6 6 6 6 6 6 6 6 1 1 1 1 1 1 1 1 1 1 1 1 1 1 1 1 1 1 1
symmnumber: 1
zpe: 750982.2 jmol-1
zpe.correction: 0.286034 hartree
zpe.thermalcorrener: 0.301452 hartree
zpe.thermalcorrenthalpy: 0.302397 hartree
zpe.thermalcorrgfe: 0.242004 hartree
zpe.sumelectzpe: -560.450711 hartree
zpe.sumelectthermal: -560.435293 hartree
zpe.sumelectthermalent: -560.434349 hartree
zpe.sumelectthermalfe: -560.494742 hartree
dipole: 0.2810 2.1467 1.3914
dipole: 2.5735
quadrupole: -71.2838 -87.6664 -87.9423
quadrupole: 0.9081 1.1606 0.9945
quadrupole: 11.0137 -5.3689 -5.6448 0.9081 1.1606 0.9945
hfenergy: -560.7367453 hartree
pointgroup: C01 [X(C13H19N1)]
dipole: -0.1489488 -0.1902349 0.9832544 debye
polarizability: 243.5992596|-10.5935148|103.8555771|5.5038069|-10.8316381|130.974009 unknown
InChI: InChI=1S/C13H19N/c1-4-11(5-2)9-13-8-7-12(6-3)10-14-13/h7-10H,4-6H2,1-3H3
charge 0 multiplicity 1
33 atoms
N  -0.98939 0.527918 -1.543765
C  2.359419 -0.165656 -0.152256
C  3.760909 0.05647 -0.713625
C  2.246349 -1.03049 1.101607
C  1.293046 0.405938 -0.799939
C  -0.144634 0.412051 -0.457083
C  -2.943845 0.48884 -0.046056
C  -4.454025 0.487386 0.112303
C  4.683302 0.841346 0.258812
C  3.111009 -2.317014 1.068185
C  -0.672091 0.382901 0.868041
C  -2.066769 0.416507 1.06598
C  -2.331019 0.556819 -1.324966
C  -5.026878 -0.938356 0.337632
H  3.689173 0.610954 -1.667685
H  4.239654 -0.915253 -0.948524
H  2.536275 -0.435082 1.994311
H  1.193791 -1.326306 1.253856
H  1.490675 0.918801 -1.751372
H  -4.742844 1.130466 0.966577
H  -4.922019 0.926577 -0.789483
H  4.813716 0.305987 1.217004
H  5.685283 0.984758 -0.185484
H  4.260012 1.837475 0.481407
H  2.922521 -2.92304 1.97312
H  4.192174 -2.093402 1.036306
H  2.864009 -2.936496 0.186942
H  0.002791 0.384534 1.727673
H  -2.474792 0.406017 2.084367
H  -2.954703 0.653205 -2.224273
H  -4.787211 -1.59801 -0.51558
H  -6.125866 -0.906465 0.452103
H  -4.599618 -1.397577 1.247664
