program: Gaussian 09
title: 000247868
version: EM64L-G09RevD.01
frameworkgroup: C1[X(C13H21NO)]
method: RPBEPBE
basis: SDD
operation: Freq
keyword: #p
keyword: freq=noraman
keyword: PBEPBE/SDD
title: #p freq=noraman PBEPBE/SDD
converged: YES YES NO NO
title: Mulliken charges:
elementType: O N C C C C C C C C C C C C C H H H H H H H H H H H H H H H H H H H H H
charge: -0.469647 -0.039107 0.310639 -0.048309 -0.571120 -0.780902 -0.755111 -0.751124 0.174286 -0.304935 0.506417 -0.342517 -0.572988 -0.534133 -0.673397 0.230392 0.202159 0.240242 0.201833 0.248995 0.228689 0.201806 0.208305 0.253608 0.268328 0.197964 0.210826 0.326175 0.262118 0.238620 0.244310 0.211516 0.210235 0.225486 0.218770 0.221571
chargesum: 0.00000
title: Mulliken charges with hydrogens summed into heavy atoms:
elementType: O N C C C C C C C C C C C C C
charge: -0.143472 -0.039107 0.310639 0.182082 -0.128719 -0.101386 -0.091391 -0.074007 0.174286 -0.042816 0.506417 -0.103896 -0.328678 -0.112382 -0.007569
polarizability: 1.93324462e+02 -1.23166244e+01 1.21652829e+02 3.40049126e+00 6.98292948e+00 1.34640679e+02
1716.lowfreq: -9.8668 -5.8662 -0.0008 -0.0004 -0.0003 13.5429 30.3781 40.0198 53.7682
frequency: 29.9443 39.8886 53.3275 84.9812 98.5978 127.2209 190.7971 207.0079 210.6348 230.2014 244.8573 251.0220 273.6712 290.0375 307.8693 314.9594 335.8694 367.1370 389.1084 395.5834 415.5761 427.2290 486.6793 488.8843 543.3248 605.0923 639.3922 679.0904 733.6303 780.7758 785.6357 823.8584 829.5588 853.5805 902.8576 915.5504 929.9637 935.3550 940.9387 962.2775 966.4864 980.2814 1006.0708 1011.3062 1052.8506 1059.2233 1065.1074 1117.7695 1128.1258 1140.8728 1170.4146 1184.9545 1195.5236 1219.2096 1236.2293 1247.5102 1276.4904 1305.5131 1310.7831 1317.7850 1324.7474 1343.7015 1350.7111 1376.7128 1380.4911 1387.3134 1390.6132 1404.2404 1447.5462 1464.0257 1470.4351 1471.9126 1473.7292 1476.3901 1480.0094 1484.6757 1488.8652 1492.4391 1498.6716 1553.3968 1593.4041 2965.8495 2973.5090 2975.5396 2978.6679 2981.0836 2984.4573 2986.5864 3036.3329 3059.8212 3061.2184 3065.0325 3069.8160 3079.4515 3080.0883 3085.4861 3095.6396 3099.1195 3105.7815 3122.0077 3170.0050 3538.1901
redmass: 3.6135 2.9717 3.0992 2.8640 3.1553 3.6659 2.5291 1.5260 1.0249 3.3123 1.4852 1.1243 1.7957 2.3069 2.3648 1.0876 2.3688 2.8527 3.0570 2.6443 3.1883 2.3331 3.1421 3.4975 2.9387 3.1537 6.3856 3.0578 3.5009 3.0198 1.2780 3.3566 3.3458 1.6394 2.1696 1.7462 1.3880 1.3340 1.5669 1.3673 2.4533 1.3904 2.2136 2.3510 1.5500 1.5012 1.9414 1.9000 1.6427 1.4205 2.2079 1.8436 1.6428 2.9106 1.7636 1.3309 1.6340 2.2588 1.5974 1.5989 1.8046 1.4932 1.9128 1.2156 1.9903 1.2551 1.1983 1.2037 1.0860 1.0532 1.3342 1.0547 1.0679 1.6538 1.0547 1.0525 1.1245 1.0578 1.0528 5.5396 6.2704 1.0655 1.0367 1.0407 1.0391 1.0360 1.0595 1.0801 1.1012 1.0978 1.0945 1.0956 1.0958 1.1001 1.1001 1.1010 1.0991 1.0989 1.0912 1.0905 1.0953 1.0657
irintensity: 0.9099 0.5322 1.2365 1.7596 2.7775 2.6468 0.7518 0.3484 0.4687 0.8869 2.0709 2.0311 4.5247 5.3121 4.5045 141.0047 3.0518 4.2818 1.4593 10.1022 4.0076 2.9433 4.7564 1.8171 5.4240 8.6666 3.7164 6.9640 0.0031 0.5438 2.4845 13.9574 17.5307 25.1449 4.7810 0.6125 3.5593 4.1717 7.8732 0.9217 7.3181 0.7177 0.7907 12.3865 8.1658 62.7140 13.9146 18.4277 20.7743 2.4210 37.3528 6.6313 9.0913 1.3132 0.8425 1.2491 4.7477 4.4139 0.1039 4.7926 0.5615 12.7240 7.7321 22.1530 6.5010 31.5161 9.1643 28.2768 5.3323 14.9077 18.0743 5.1382 14.7430 39.0945 13.5562 0.8958 26.6922 1.6208 16.1654 10.9482 9.2205 21.1900 20.1305 44.5315 48.6461 36.8128 39.2488 20.2779 8.4581 5.5009 4.6795 58.7058 62.8533 61.2933 9.8657 37.1040 20.2435 24.3962 33.0223 16.9813 4.4021 3.2071
temp: 298.150 k
press: 1.00000 atm
elementType: 8 7 6 6 6 6 6 6 6 6 6 6 6 6 6 1 1 1 1 1 1 1 1 1 1 1 1 1 1 1 1 1 1 1 1 1
symmnumber: 1
zpe: 819335.4 jmol-1
zpe.correction: 0.312068 hartree
zpe.thermalcorrener: 0.328866 hartree
zpe.thermalcorrenthalpy: 0.329810 hartree
zpe.thermalcorrgfe: 0.267822 hartree
zpe.sumelectzpe: -636.782417 hartree
zpe.sumelectthermal: -636.765619 hartree
zpe.sumelectthermalent: -636.764675 hartree
zpe.sumelectthermalfe: -636.826663 hartree
dipole: -0.5929 -1.0938 -0.8826
dipole: 1.5255
quadrupole: -79.9976 -89.7457 -97.0383
quadrupole: -5.7410 3.6939 3.6255
quadrupole: 8.9296 -0.8185 -8.1111 -5.7410 3.6939 3.6255
hfenergy: -637.094485 hartree
pointgroup: C01 [X(C13H21N1O1)]
dipole: 0.2683273 0.4785447 -0.2432921 debye
polarizability: 191.9586305|-15.1823429|126.7135525|-5.0834577|-8.9996962|130.9457865 unknown
InChI: InChI=1S/C13H21NO/c1-5-11-6-7-12(14-9-11)8-13(4,15)10(2)3/h6-7,9-10,15H,5,8H2,1-4H3
charge 0 multiplicity 1
36 atoms
O  -2.227535 1.299409 -1.389956
N  0.760897 0.009899 1.572208
C  -2.406625 0.577836 -0.08968
C  -2.20415 -0.924582 -0.455297
C  -1.338405 1.1043 0.924705
C  -3.816617 0.894979 0.456608
C  -3.240717 -1.42165 -1.490901
C  -2.184504 -1.843295 0.790432
C  0.110117 0.758573 0.623795
C  0.776644 1.199192 -0.551041
C  2.820192 0.092879 0.226288
C  2.131107 0.86269 -0.7468
C  2.07341 -0.300951 1.364143
C  4.271381 -0.319988 0.046624
C  4.435653 -1.493541 -0.956493
H  -1.205172 -0.975275 -0.93437
H  -1.455284 2.207307 0.975372
H  -1.561783 0.711972 1.931859
H  -3.896577 1.965327 0.732354
H  -4.584813 0.676734 -0.304242
H  -4.043874 0.304854 1.36195
H  -4.248338 -1.520416 -1.044048
H  -2.948896 -2.420023 -1.866496
H  -3.300861 -0.729912 -2.347867
H  -1.374171 -1.576419 1.491165
H  -3.148607 -1.808971 1.333175
H  -2.024848 -2.890987 0.475001
H  -2.50847 2.24157 -1.255947
H  0.217799 1.772743 -1.294978
H  2.655959 1.200008 -1.64931
H  2.550519 -0.895759 2.15451
H  4.865199 0.544308 -0.310066
H  4.696751 -0.616347 1.024454
H  3.887288 -2.387428 -0.608965
H  5.500744 -1.764878 -1.073571
H  4.038987 -1.222558 -1.951813
