program: Gaussian 09
title: 000247867
version: EM64L-G09RevD.01
frameworkgroup: C1[X(C13H21NO)]
method: RPBEPBE
basis: SDD
operation: Freq
keyword: #p
keyword: freq=noraman
keyword: PBEPBE/SDD
title: #p freq=noraman PBEPBE/SDD
converged: YES YES NO NO
title: Mulliken charges:
elementType: O N C C C C C C C C C C C C C H H H H H H H H H H H H H H H H H H H H H
charge: -0.463434 -0.017188 0.307313 -0.427241 -0.540066 -0.382432 -0.742193 0.147644 -0.697971 -0.359843 0.500104 -0.337090 -0.562820 -0.531943 -0.673292 0.210859 0.199682 0.211652 0.228103 0.236826 0.201681 0.229223 0.209787 0.229757 0.336152 0.215504 0.206772 0.213602 0.268396 0.242552 0.246556 0.212183 0.213768 0.220765 0.221785 0.224849
chargesum: 0.00000
title: Mulliken charges with hydrogens summed into heavy atoms:
elementType: O N C C C C C C C C C C C C C
charge: -0.127282 -0.017188 0.307313 -0.016700 -0.100311 0.056075 -0.073426 0.147644 -0.062093 -0.091447 0.500104 -0.094538 -0.316264 -0.105992 -0.005894
polarizability: 1.93100316e+02 -8.82751141e+00 1.46515694e+02 -9.63803722e+00 -7.26999898e+00 1.11338529e+02
1716.lowfreq: -4.7079 -0.0006 -0.0006 0.0005 4.5057 13.4100 24.1851 39.2599 47.2990
frequency: 23.4961 39.2042 47.1791 58.6447 75.4023 117.3862 139.0688 171.2562 202.9255 210.5738 216.7759 233.5777 260.9241 275.1496 322.8526 333.6494 346.1053 384.3834 393.5528 409.3398 416.4697 471.5168 490.5190 498.5613 597.9246 637.6857 712.2782 744.1032 751.4403 783.3155 795.7855 829.9350 849.1067 855.0070 865.8639 908.2682 922.5180 933.8175 958.2855 966.5483 977.9244 1008.5501 1014.1439 1048.5076 1050.1278 1063.6702 1081.6172 1104.7902 1117.5120 1140.2091 1179.5246 1218.4677 1222.5656 1236.2867 1244.4570 1253.3830 1270.4482 1286.1224 1302.9247 1304.5239 1314.6035 1323.1029 1347.4427 1361.9946 1379.5667 1387.0994 1389.8059 1390.8168 1446.5509 1459.2344 1465.2777 1470.5122 1472.7444 1473.8244 1476.4100 1477.0815 1481.1866 1485.4866 1488.8526 1552.3196 1591.5900 2960.3275 2971.9222 2981.0881 2982.6079 2985.6034 2992.8380 3009.6797 3014.1834 3037.7866 3042.1787 3071.9252 3072.1364 3077.4013 3080.3835 3084.7299 3093.9786 3095.3684 3107.6276 3121.8454 3155.8871 3529.3323
redmass: 3.1055 2.8340 3.4378 4.3445 1.7010 3.0714 3.4119 3.0626 1.2352 1.1403 2.3722 1.3354 2.5774 2.6323 2.4528 2.1120 1.1407 3.2386 2.1534 3.4471 3.5353 3.0628 2.8716 3.5032 2.8373 7.0248 3.7214 1.1999 3.0818 1.1858 3.7999 2.9977 2.6686 1.5364 1.6811 1.7654 1.7529 1.4126 1.7521 2.5330 1.3562 2.3631 1.8329 2.1359 1.6671 1.9954 1.6500 1.7652 1.7588 1.3201 1.8452 2.2523 1.7907 1.6036 1.3036 1.7455 1.6164 1.2964 1.9711 1.3615 1.5954 2.1241 1.6673 1.4892 2.0344 1.2402 1.1969 1.3042 1.1054 1.0820 1.0591 1.4571 1.0582 1.0514 1.4312 1.0454 1.1097 1.0731 1.1208 5.5069 6.2114 1.0600 1.0356 1.0351 1.0603 1.0603 1.0359 1.0627 1.0949 1.1011 1.1011 1.0998 1.1011 1.1010 1.1001 1.1012 1.0999 1.0995 1.0912 1.0897 1.0963 1.0653
irintensity: 0.4340 0.3889 0.3075 3.3886 0.3824 0.8353 0.3946 0.5884 0.5702 2.4793 0.2219 0.2356 1.0344 1.0787 5.6532 1.0493 177.2669 2.3321 1.3938 8.4178 4.9455 6.8092 10.3906 3.9377 7.5275 1.7833 4.4223 15.6168 4.7495 3.5439 2.1588 2.6138 15.8944 2.7415 18.4662 3.1367 6.5761 3.3712 0.6569 7.3071 0.7106 0.3383 25.9610 2.1394 0.7781 16.2379 2.9558 8.4394 44.0566 9.8710 17.6430 6.8305 9.6977 0.9580 2.5943 39.7412 16.3953 4.9637 0.4672 4.8500 4.0412 2.1872 16.6197 11.7586 18.0131 8.6893 9.8734 38.0425 6.2534 3.6257 9.8678 20.7487 4.3818 15.1656 30.0454 10.0691 8.7416 16.0502 25.1169 14.2898 7.4452 14.8679 43.0544 34.5219 33.2067 37.2634 23.1581 25.3812 21.3921 7.2610 10.2122 47.9799 79.4744 9.4693 54.3899 38.0046 34.5651 29.6888 28.6132 17.0070 7.2742 3.3703
temp: 298.150 k
press: 1.00000 atm
elementType: 8 7 6 6 6 6 6 6 6 6 6 6 6 6 6 1 1 1 1 1 1 1 1 1 1 1 1 1 1 1 1 1 1 1 1 1
symmnumber: 1
zpe: 819923.4 jmol-1
zpe.correction: 0.312292 hartree
zpe.thermalcorrener: 0.329259 hartree
zpe.thermalcorrenthalpy: 0.330203 hartree
zpe.thermalcorrgfe: 0.266717 hartree
zpe.sumelectzpe: -636.784875 hartree
zpe.sumelectthermal: -636.767909 hartree
zpe.sumelectthermalent: -636.766964 hartree
zpe.sumelectthermalfe: -636.830450 hartree
dipole: -2.6458 0.2515 0.1847
dipole: 2.6642
quadrupole: -82.3234 -93.6655 -96.9169
quadrupole: 2.3905 -4.8534 2.8779
quadrupole: 8.6452 -2.6969 -5.9483 2.3905 -4.8534 2.8779
hfenergy: -637.0971678 hartree
pointgroup: C01 [X(C13H21N1O1)]
dipole: -1.0410967 0.0798398 0.0915282 debye
polarizability: 193.0286706|-8.3961698|145.5105896|-10.8722992|-8.6656936|112.4152794 unknown
InChI: InChI=1S/C13H21NO/c1-4-8-13(3,15)9-12-7-6-11(5-2)10-14-12/h6-7,10,15H,4-5,8-9H2,1-3H3
charge 0 multiplicity 1
36 atoms
O  1.829088 -1.549357 1.458503
N  -0.537212 0.521757 -1.109817
C  2.291503 -0.746564 0.28938
C  2.295325 0.750939 0.697068
C  1.361715 -1.043299 -0.939603
C  2.795006 1.749601 -0.372824
C  3.703709 -1.287447 0.012516
C  -0.09781 -0.714582 -0.704563
C  2.815394 3.198876 0.160749
C  -0.975422 -1.638917 -0.075037
C  -2.791007 -0.006414 -0.265804
C  -2.322544 -1.281024 0.143841
C  -1.844041 0.845193 -0.891013
C  -4.223691 0.439937 -0.028465
C  -4.473386 0.883026 1.438391
H  2.918789 0.838709 1.609861
H  1.263875 1.044663 0.985029
H  1.469017 -2.119003 -1.171976
H  1.718521 -0.463581 -1.808319
H  2.130185 1.699769 -1.25549
H  3.813255 1.468496 -0.707227
H  4.376772 -1.044759 0.853061
H  4.123113 -0.858904 -0.914326
H  3.668334 -2.385819 -0.092612
H  0.961061 -1.176728 1.764641
H  3.174653 3.905726 -0.609655
H  3.477626 3.291961 1.042547
H  1.801013 3.518799 0.465021
H  -0.598822 -2.62532 0.213426
H  -3.010238 -1.990297 0.62093
H  -2.15078 1.839538 -1.242107
H  -4.468118 1.279035 -0.707315
H  -4.918798 -0.38495 -0.278979
H  -4.258705 0.059433 2.143404
H  -5.524948 1.191381 1.581579
H  -3.824228 1.735128 1.708883
