program: Gaussian 09
title: 000020118
version: EM64L-G09RevD.01
frameworkgroup: C1[X(C16H19NO)]
method: RPBEPBE
basis: SDD
operation: Freq
keyword: #p
keyword: freq=noraman
keyword: PBEPBE/SDD
title: #p freq=noraman PBEPBE/SDD
converged: YES YES NO NO
title: Mulliken charges:
elementType: O N C C C C C C C C C C C C C C C C H H H H H H H H H H H H H H H H H H H
charge: -0.480523 -0.390088 -0.461186 -0.180335 -0.336514 -0.578585 0.454685 0.496189 -0.422330 -0.403834 -0.408159 -0.411265 -0.229031 -0.219933 -0.226466 -0.226490 -0.243281 -0.241520 0.209450 0.252266 0.206812 0.214502 0.236576 0.196593 0.228187 0.279464 0.227348 0.280085 0.236903 0.229398 0.361352 0.221929 0.222347 0.226358 0.225065 0.224896 0.229136
chargesum: 0.00000
title: Mulliken charges with hydrogens summed into heavy atoms:
elementType: O N C C C C C C C C C C C C C C C C
charge: -0.119171 -0.110624 0.000530 0.026477 0.114564 -0.153805 0.454685 0.496189 -0.194983 -0.123750 -0.171256 -0.181867 -0.007102 0.002414 -0.000108 -0.001426 -0.018385 -0.012384
polarizability: 2.42329372e+02 1.76751255e+01 1.50777353e+02 -1.98147266e-01 -6.14933093e+00 1.39367282e+02
1716.lowfreq: -12.3682 -4.8208 0.0006 0.0007 0.0009 4.6743 13.5255 21.0965 23.8578
frequency: 13.1133 20.6849 23.8397 40.5218 42.9236 82.0172 91.4066 119.3310 200.5405 229.6646 230.8187 279.2631 315.5198 337.8783 371.4081 403.6193 403.6504 409.1842 503.2035 518.9552 550.0028 578.7975 615.7962 618.0774 623.3982 678.7414 705.1668 705.9775 742.6268 758.3358 762.7093 792.9204 808.9705 821.2903 853.8544 857.7417 886.0946 910.0187 920.8740 950.7844 976.5677 980.2564 988.8883 990.2870 995.3640 999.9972 1009.0313 1023.2191 1025.9182 1033.2350 1037.1253 1071.0363 1088.9995 1098.2206 1126.6578 1168.3764 1172.3276 1174.5164 1178.4629 1187.5183 1202.1526 1212.1409 1217.0251 1264.1911 1271.0908 1287.0903 1294.0566 1326.5212 1327.6540 1332.8258 1356.7737 1382.8311 1386.8329 1398.8609 1437.3160 1439.3983 1442.5637 1451.3539 1474.2761 1482.4038 1485.1093 1493.6604 1593.7050 1594.0367 1614.3392 1615.3110 2908.6796 2914.9659 2941.6838 2976.9339 3024.1767 3050.8810 3054.4454 3108.0926 3113.7448 3116.6725 3123.1903 3132.2067 3137.2027 3144.3765 3155.2597 3162.9300 3169.4833 3204.2612 3461.3978
redmass: 3.8603 4.1081 5.1554 3.6678 3.7337 3.5806 3.6279 3.0831 4.4570 3.5153 4.5175 3.4854 3.8118 2.3994 4.3181 2.8347 2.8414 3.1373 3.4004 3.0565 2.6669 4.8143 6.3764 6.2966 3.9767 1.5231 1.7674 1.7802 1.1952 1.7632 1.7984 1.2522 3.1562 3.2497 1.2473 1.2507 2.9059 1.5429 1.4419 2.3210 1.3878 1.3690 5.7336 6.2888 1.3164 1.3577 2.0087 2.2770 2.3320 2.8921 2.4732 2.0126 1.7695 1.5720 3.6427 1.0855 1.0786 1.1451 1.1404 1.1154 1.6974 1.7157 2.2149 1.2368 1.1947 1.3611 1.2526 1.2394 1.2531 1.2551 1.3659 7.9072 6.5535 1.5224 1.9254 1.7928 1.5354 1.0975 1.1175 2.3901 2.2309 1.0911 6.2213 6.0527 6.1730 6.1795 1.0699 1.0823 1.0666 1.0628 1.0889 1.1010 1.0965 1.0873 1.0875 1.0871 1.0866 1.0906 1.0928 1.0957 1.0977 1.1015 1.0969 1.0635 1.0753
irintensity: 0.1488 0.3385 0.0908 1.9865 0.8321 1.5187 1.5211 0.3269 3.6885 2.8886 2.3046 7.8062 6.1707 1.1288 6.8748 0.0629 0.1640 1.4034 12.4148 8.0032 25.8404 9.9457 0.0584 0.2088 26.7009 47.1565 46.3292 46.6568 58.0387 50.9830 81.4753 0.6250 6.7689 4.8332 0.0275 0.4695 24.4233 5.7352 4.1739 6.0274 0.0450 0.2433 0.0733 0.1003 0.2301 1.8286 17.8066 13.9394 7.0881 5.9555 24.4105 17.8144 0.4640 15.6532 95.1818 1.6919 1.5460 4.8657 0.9044 0.2597 34.3977 5.7109 6.5558 7.8335 12.6593 7.6447 10.6660 11.4863 1.4750 29.4014 9.8780 0.0575 6.0012 80.4571 12.6643 9.7842 8.0090 10.9079 6.0648 15.9963 17.0050 9.2021 0.2993 1.4023 11.2041 6.8569 45.1414 62.2380 56.5608 34.2709 10.6223 30.5043 25.0449 12.9192 9.8853 7.9555 1.4802 10.0600 35.7793 42.2282 32.1094 23.7944 12.5158 219.4452 0.5317
temp: 298.150 k
press: 1.00000 atm
elementType: 8 7 6 6 6 6 6 6 6 6 6 6 6 6 6 6 6 6 1 1 1 1 1 1 1 1 1 1 1 1 1 1 1 1 1 1 1
symmnumber: 1
zpe: 815792.4 jmol-1
zpe.correction: 0.310719 hartree
zpe.thermalcorrener: 0.327474 hartree
zpe.thermalcorrenthalpy: 0.328418 hartree
zpe.thermalcorrgfe: 0.261758 hartree
zpe.sumelectzpe: -749.743835 hartree
zpe.sumelectthermal: -749.727080 hartree
zpe.sumelectthermalent: -749.726136 hartree
zpe.sumelectthermalfe: -749.792796 hartree
dipole: 2.2865 0.6205 -2.9208
dipole: 3.7609
quadrupole: -104.8687 -104.5445 -106.2878
quadrupole: 1.0039 3.7877 3.5183
quadrupole: 0.3650 0.6892 -1.0542 1.0039 3.7877 3.5183
hfenergy: -750.0545541 hartree
pointgroup: C01 [X(C16H19N1O1)]
dipole: -0.878935 1.0543047 0.55252 debye
polarizability: 242.6311886|-12.2627562|150.1241904|11.4345372|-6.7228088|139.7186277 unknown
InChI: InChI=1S/C16H19NO/c18-16(15-9-5-2-6-10-15)13-17-12-11-14-7-3-1-4-8-14/h1-10,16-18H,11-13H2
charge 0 multiplicity 1
37 atoms
O  1.664561 -1.882239 0.290588
N  -0.023937 -0.171119 1.44105
C  1.249372 0.420427 0.961982
C  1.838077 -0.505905 -0.158074
C  -1.228416 0.140328 0.633447
C  -2.476131 -0.573496 1.210189
C  3.30425 -0.192402 -0.413355
C  -3.729624 -0.261924 0.405422
C  3.661549 0.930986 -1.201312
C  4.325354 -0.986938 0.161494
C  -4.089267 -1.057307 -0.713211
C  -4.540997 0.855836 0.729304
C  5.020063 1.265545 -1.399642
C  5.684336 -0.655625 -0.040593
C  -5.228309 -0.744155 -1.488856
C  -5.681242 1.173287 -0.042919
C  6.036982 0.473243 -0.816968
C  -6.028287 0.373857 -1.156525
H  1.138831 1.45929 0.581143
H  1.963699 0.433848 1.804997
H  1.262711 -0.339691 -1.097253
H  -1.42183 1.237299 0.577398
H  -1.057252 -0.208291 -0.401992
H  -2.613721 -0.253094 2.262979
H  -2.276237 -1.661029 1.224174
H  -0.184511 -0.005869 2.442578
H  2.878063 1.539982 -1.671348
H  4.03153 -1.867967 0.739905
H  -3.477022 -1.930193 -0.973095
H  -4.281929 1.476988 1.596394
H  0.853514 -1.819302 0.892653
H  5.285303 2.134837 -2.012429
H  6.468799 -1.281063 0.401309
H  -5.493949 -1.372533 -2.346583
H  -6.299374 2.037906 0.224642
H  7.091403 0.727501 -0.974707
H  -6.913664 0.61578 -1.755086
