program: Gaussian 09
title: 000247844
version: EM64L-G09RevD.01
frameworkgroup: C1[X(C19H33NO3)]
method: RPBEPBE
basis: SDD
operation: Freq
keyword: #p
keyword: freq=noraman
keyword: PBEPBE/SDD
title: #p freq=noraman PBEPBE/SDD
converged: NO YES NO NO
title: Mulliken charges:
elementType: O O O N C C C C C C C C C C C C C C C C C C C H H H H H H H H H H H H H H H H H H H H H H H H H H H H H H H H H
charge: -0.288005 -0.285138 -0.293073 -0.071071 -0.158169 -0.165974 -0.266484 -0.261413 -0.533912 -0.490426 -0.496026 -0.228759 -0.229947 -0.338467 -0.431205 -0.231570 -0.261920 -0.261469 -0.252259 -0.417232 0.054876 -0.715441 -0.507329 0.255718 0.259097 0.244526 0.243482 0.252200 0.221134 0.220810 0.229730 0.224397 0.220962 0.237203 0.237066 0.199342 0.198316 0.210573 0.211921 0.224575 0.171414 0.195758 0.197094 0.196886 0.195600 0.169350 0.225351 0.223268 0.203033 0.168393 0.215672 0.229057 0.215883 0.205529 0.194712 0.232361
chargesum: 0.00000
title: Mulliken charges with hydrogens summed into heavy atoms:
elementType: O O O N C C C C C C C C C C C C C C C C C C C
charge: -0.288005 -0.285138 -0.293073 -0.071071 0.097549 0.093123 -0.021958 -0.017931 -0.060578 -0.039885 -0.050667 0.008444 0.007119 0.059192 -0.008710 0.164419 0.130932 0.131017 0.142441 0.009070 0.223269 -0.054830 0.125273
polarizability: 2.74956952e+02 6.84783961e-01 1.89716625e+02 1.91010483e+00 -9.23410449e+00 1.84641759e+02
1716.lowfreq: -11.8417 -8.8467 -0.0017 0.0014 0.0015 0.5993 3.7277 13.3339 20.0680
frequency: -10.0499 7.9953 19.3301 30.6943 38.8879 46.9027 65.0186 65.3850 81.6724 92.1329 109.0664 114.7827 119.3390 137.1772 143.6078 170.4904 194.2672 198.7844 227.8359 237.5893 248.1505 271.5824 288.1058 310.2508 349.0683 364.2076 391.8701 417.5587 432.6482 443.5056 449.7159 501.4716 503.5644 516.9954 552.0691 613.4677 631.7825 668.7355 707.6418 739.2955 742.9231 764.7667 790.8039 805.7026 814.2930 820.2029 834.5185 873.4119 888.5021 893.8379 897.3396 900.5391 918.4120 919.2745 932.9296 945.1430 954.3689 956.9369 959.0453 979.9749 1002.0006 1008.3770 1011.5478 1016.4486 1020.5651 1039.1975 1041.2567 1050.4669 1061.4466 1074.3205 1076.4297 1089.8785 1091.5948 1098.8739 1104.0405 1109.7727 1113.1637 1115.0978 1128.8716 1135.4270 1142.7295 1150.9445 1152.9046 1154.9669 1173.3891 1182.0806 1205.4294 1206.6219 1226.5945 1230.3703 1247.2025 1254.5041 1256.2021 1257.3232 1260.3060 1269.9937 1271.1920 1277.2041 1281.1378 1290.8016 1304.1813 1312.6446 1313.6272 1316.2901 1320.8173 1323.0821 1328.0394 1345.3986 1358.3460 1368.4129 1378.1943 1390.8682 1418.2379 1434.6140 1451.5502 1456.9352 1463.8443 1465.1227 1465.2102 1468.0681 1472.9110 1477.9451 1479.4048 1481.6457 1484.8089 1492.3130 1494.4557 1498.1726 1581.3464 2865.8281 2899.2909 2912.0247 2916.4652 2926.3886 2938.2286 2943.1648 2979.2753 2979.4914 2982.9197 2990.4696 2993.9121 2996.6135 2997.8553 3003.7916 3005.2717 3010.4335 3011.4360 3020.5039 3024.0993 3038.5842 3055.2915 3064.9229 3067.2549 3067.7265 3072.5116 3075.7780 3078.6297 3087.7367 3092.2630 3094.2500 3151.8066 3185.3217
redmass: 3.6985 3.7873 4.0098 4.0386 3.2831 2.5866 3.4468 3.0594 3.1128 2.2303 3.4891 2.1728 3.9265 2.9095 3.4561 2.9280 1.0302 2.5784 1.7867 3.2465 2.3944 2.6873 2.5773 3.3415 2.3461 3.5008 2.7349 2.1537 3.3451 2.9643 3.2588 2.0089 2.8987 2.7461 3.3457 2.9637 3.4928 2.6220 1.7777 2.4134 2.3808 4.0639 3.1901 2.1420 1.3246 1.9655 1.1365 1.9275 2.3807 2.5587 2.7969 2.3344 2.4057 1.4489 2.1542 2.9518 1.8277 2.8716 1.7632 2.2120 1.9649 1.9417 1.6592 3.3807 2.1003 3.9831 3.3135 2.5397 5.0501 2.9838 2.7540 1.9125 1.6393 1.8473 1.1782 1.3990 1.6716 1.8228 2.2853 1.8789 1.9751 1.4106 1.4588 1.5079 1.2752 1.3555 1.3509 1.4309 1.4700 1.3067 1.3990 1.1486 1.4527 1.4381 1.3223 1.1640 1.1844 1.2283 1.2812 1.4155 1.1848 1.3533 1.7105 1.5433 1.2646 1.2412 1.2377 1.4445 1.4402 1.4331 1.2300 1.4876 1.5553 1.1336 1.0837 1.0549 1.0933 1.0564 1.0838 1.0797 1.0893 1.0564 1.0816 1.0538 1.0840 1.0940 1.0769 1.0791 5.7727 1.0698 1.0821 1.0648 1.0624 1.0356 1.0567 1.0540 1.1038 1.0653 1.0364 1.0658 1.0917 1.0665 1.0937 1.0741 1.0864 1.1100 1.0879 1.0598 1.0859 1.0881 1.1025 1.0981 1.0883 1.1029 1.0984 1.0936 1.0988 1.1002 1.1049 1.0974 1.0869 1.1097
irintensity: 0.1343 0.6326 0.4238 0.3133 1.0392 0.2021 0.3796 2.3423 1.5018 9.6540 0.9329 0.0921 2.9475 0.3566 10.3397 2.4025 0.2756 0.4235 3.2048 0.0123 3.3464 4.6707 0.7447 4.9678 4.8534 1.1381 2.5089 3.1260 0.6822 6.4158 1.8435 5.5594 0.6559 7.7923 3.4562 8.8023 0.5289 1.6123 71.6581 11.3780 5.6030 1.7358 8.1001 13.6415 4.0603 2.2614 2.1490 11.0987 0.8962 3.1470 19.6348 4.2768 7.9650 2.1097 23.7654 10.3483 1.5475 4.4868 2.4167 3.3864 3.2791 5.1890 4.4417 47.1336 0.6929 10.3353 14.1007 6.3506 138.9498 212.4564 147.4353 1.5096 10.4634 27.3671 0.6287 2.4032 7.0832 4.8567 1.7069 4.2218 34.1781 3.0073 2.6156 0.8120 7.8225 5.4284 6.2932 0.2476 2.5970 0.9106 13.2147 0.1392 6.3790 0.7155 0.3204 1.7370 0.6314 0.0415 0.1973 0.3645 14.8364 2.5372 14.2230 7.6510 12.6607 6.9709 9.2203 22.5938 1.9938 16.4857 25.1127 10.0103 0.9760 2.5269 3.0714 12.9452 4.1694 4.9124 3.7172 26.5919 4.2822 11.4065 2.6099 9.7768 14.1842 14.5582 0.0824 6.5040 4.0287 86.0099 38.2859 78.2747 45.5714 91.7957 3.5534 128.7851 1.2411 46.0346 16.3992 30.7283 22.3453 24.9173 26.7836 26.9508 84.3120 101.4664 28.2327 40.3067 1.0760 26.6321 48.8763 47.5423 86.6177 22.2970 58.6642 6.1617 52.5267 37.4752 31.6169 33.7615 7.6927 27.3076
temp: 298.150 k
press: 1.00000 atm
elementType: 8 8 8 7 6 6 6 6 6 6 6 6 6 6 6 6 6 6 6 6 6 6 6 1 1 1 1 1 1 1 1 1 1 1 1 1 1 1 1 1 1 1 1 1 1 1 1 1 1 1 1 1 1 1 1 1
symmnumber: 1
zpe: 1289887.1 jmol-1
zpe.correction: 0.491292 hartree
zpe.thermalcorrener: 0.515545 hartree
zpe.thermalcorrenthalpy: 0.516489 hartree
zpe.thermalcorrgfe: 0.433118 hartree
zpe.sumelectzpe: -1022.285378 hartree
zpe.sumelectthermal: -1022.261125 hartree
zpe.sumelectthermalent: -1022.260181 hartree
zpe.sumelectthermalfe: -1022.343552 hartree
dipole: -0.4341 -0.8634 -0.8497
dipole: 1.2868
quadrupole: -105.2015 -138.9396 -140.5701
quadrupole: -1.7380 4.6149 -2.9203
quadrupole: 23.0356 -10.7025 -12.3330 -1.7380 4.6149 -2.9203
hfenergy: -1022.7766701 hartree
pointgroup: C01 [X(C19H33N1O3)]
dipole: -0.163105 0.3030938 0.3712679 debye
polarizability: 274.8842453|-2.1163485|191.7686855|-2.597027|-8.3814192|182.6624055 unknown
InChI: InChI=1S/C19H33NO3/c1-15(21-2)6-9-23-11-10-22-8-3-7-20-13-18-16-4-5-17(12-16)19(18)14-20/h4-5,15-19H,3,6-14H2,1-2H3
charge 0 multiplicity 1
56 atoms
O  -1.04128 1.018838 0.966033
O  -4.510136 0.783214 -0.216475
O  -8.176766 -1.313837 0.142522
N  3.14913 0.598601 -0.183885
C  5.072894 -0.720282 0.619615
C  5.616175 0.520115 -0.196333
C  5.938104 -1.916184 0.057922
C  6.725663 -0.125981 -1.116207
C  6.071443 -1.506574 -1.444128
C  3.543837 -0.769404 0.282211
C  4.352353 1.073773 -0.936565
C  7.378626 -1.655942 0.531579
C  7.849402 -0.583781 -0.169963
C  2.743505 1.507598 0.928437
C  1.322391 1.203251 1.448516
C  0.255119 1.360702 0.362434
C  -2.140275 1.098772 0.000164
C  -3.403072 0.651929 0.735056
C  -5.786444 0.321337 0.345961
C  -6.845345 0.479065 -0.748638
C  -8.25788 0.106822 -0.268156
C  -9.3209 0.331918 -1.36058
C  -9.346036 -1.792808 0.874806
H  5.231555 -0.605538 1.705448
H  6.054139 1.29059 0.461358
H  5.527788 -2.915264 0.273981
H  7.033044 0.501337 -1.967909
H  6.747649 -2.172433 -2.005744
H  5.106063 -1.431048 -1.97508
H  2.926982 -1.075893 1.143664
H  3.356416 -1.493487 -0.533978
H  4.309449 0.66684 -1.966101
H  4.344467 2.174973 -1.012802
H  7.87334 -2.185795 1.350387
H  8.803906 -0.067044 -0.0364
H  3.45514 1.479448 1.791016
H  2.765919 2.540921 0.530793
H  1.264182 0.174299 1.851643
H  1.090967 1.885617 2.289152
H  0.475864 0.689131 -0.492773
H  0.231664 2.408344 -0.017176
H  -2.264985 2.138318 -0.373214
H  -1.949983 0.436092 -0.871261
H  -3.296632 -0.400575 1.07501
H  -3.571059 1.292158 1.628046
H  -6.048918 0.934072 1.239924
H  -5.711531 -0.739334 0.661453
H  -6.575083 -0.160277 -1.60947
H  -6.844662 1.528207 -1.100157
H  -8.517966 0.715406 0.631742
H  -9.325344 1.391072 -1.677617
H  -9.098253 -0.294571 -2.242941
H  -10.337164 0.085228 -1.004787
H  -10.246397 -1.869841 0.231168
H  -9.58158 -1.136784 1.741282
H  -9.083286 -2.798112 1.241917
