program: Gaussian 09
title: 000247827
version: EM64L-G09RevD.01
frameworkgroup: C1[X(C9H6ClNO)]
method: RPBEPBE
basis: SDD
operation: Freq
keyword: #p
keyword: freq=noraman
keyword: PBEPBE/SDD
title: #p freq=noraman PBEPBE/SDD
converged: NO YES NO NO
title: Mulliken charges:
elementType: Cl O N C C C C C C C C C H H H H H H
charge: -0.048517 -0.241165 -0.107591 0.346488 0.098473 -0.339266 -0.355488 -0.203572 -0.201633 -0.103245 -0.140152 -0.298332 0.264564 0.276475 0.258250 0.259697 0.268980 0.266033
chargesum: 0.00000
title: Mulliken charges with hydrogens summed into heavy atoms:
elementType: Cl O N C C C C C C C C C
charge: -0.048517 -0.241165 -0.107591 0.346488 0.098473 -0.074702 -0.079013 0.054679 0.058064 -0.103245 0.128828 -0.032298
polarizability: 2.15625210e+02 1.01293192e-01 1.05053762e+02 5.84320642e-03 7.08222806e-03 4.37475781e+01
1716.lowfreq: -8.7820 -0.0017 -0.0014 -0.0013 2.3868 6.2184 64.6928 66.7621 114.4370
frequency: 64.6586 66.7223 114.4369 179.3090 266.6355 273.4296 334.3201 407.3330 443.2224 488.9025 497.1670 596.1774 622.0028 687.8483 716.8142 723.7774 746.9599 833.9053 843.3680 844.7425 857.8633 892.6418 968.0139 980.5957 984.0267 1008.7354 1023.7107 1071.4652 1081.7254 1107.7615 1119.1303 1185.1087 1243.6902 1294.1330 1302.2984 1369.9120 1404.1563 1454.4954 1477.0190 1544.3943 1578.7845 1610.3333 3157.9550 3158.2805 3175.5495 3179.2152 3244.2372 3284.7004
redmass: 5.2555 7.6627 6.7381 6.6233 9.4515 8.6198 6.5816 2.9185 5.6313 8.2222 3.1025 3.3571 7.1464 6.1393 7.2602 3.7682 1.2882 1.2761 1.5121 6.3605 1.3537 8.2084 1.3520 1.3614 7.9342 4.2018 5.1629 2.8240 2.5366 1.3309 1.3628 1.1203 4.6597 1.3062 1.7191 5.8543 3.7838 2.5455 4.1712 7.9171 7.9219 6.3879 1.0885 1.0888 1.0969 1.0981 1.0926 1.1095
irintensity: 0.6757 0.1000 0.5227 4.7944 2.3500 1.4318 6.0180 0.0151 5.2247 26.8472 14.4361 1.2213 0.6104 17.1123 9.6527 16.5686 50.0089 9.1034 69.9581 7.8486 10.7247 17.7755 1.2442 0.3783 43.2908 9.1300 12.1449 48.2172 13.6883 10.4337 5.5348 0.9951 7.5270 0.5575 4.5091 2.9335 12.7625 96.3280 37.5897 1.8134 4.3730 36.3347 0.9982 1.0678 3.6324 0.9179 7.1093 0.4563
temp: 298.150 k
press: 1.00000 atm
elementType: 17 8 7 6 6 6 6 6 6 6 6 6 1 1 1 1 1 1
symmnumber: 1
zpe: 332033.5 jmol-1
zpe.correction: 0.126465 hartree
zpe.thermalcorrener: 0.135969 hartree
zpe.thermalcorrenthalpy: 0.136913 hartree
zpe.thermalcorrgfe: 0.090349 hartree
zpe.sumelectzpe: -935.741323 hartree
zpe.sumelectthermal: -935.731819 hartree
zpe.sumelectthermalent: -935.730875 hartree
zpe.sumelectthermalfe: -935.777439 hartree
dipole: 2.2847 -1.1229 -0.0001
dipole: 2.5458
quadrupole: -67.9834 -70.7965 -79.5135
quadrupole: -4.0324 -0.0004 0.0018
quadrupole: 4.7811 1.9680 -6.7491 -4.0324 -0.0004 0.0018
hfenergy: -935.8677879 hartree
pointgroup: C01 [X(C9H6Cl1N1O1)]
dipole: -0.8948461 0.4499157 -0.0000378 debye
dipolederiv: -1.0178711 -0.0065877 0.000049 -0.0107239 -0.1227839 -0.0000012 0.0000639 -0.0000024 -0.0649934 -0.2899242 -0.1354955 0.0001678 0.1087454 -0.6353539 0.0000208 0.0002065 -0.0001575 -0.0968717 -0.3907681 -0.0633967 -0.0000289 -0.2765756 -0.3807529 0.0000449 -0.0000984 0.0000003 -0.2298343 0.0482465 0.0090508 -0.0000061 0.0179671 -0.0645363 -0.000039 0.0000901 0.0000131 0.0356499 0.7311463 0.0298822 -0.0000798 -0.0936303 0.485667 0.0001619 -0.0000877 -0.0000394 0.0792782 0.0746326 -0.05322 -0.0000109 0.060527 0.0329455 0.0000142 -0.000093 0.0000148 -0.1347741 0.0307941 0.0674418 -0.0000151 -0.0634716 0.0383579 0.0000103 0.0000819 0.0000136 -0.1276053 -0.3974056 0.1045511 0.0000083 0.195949 -0.0009674 -0.0000018 0.0000104 -0.0000033 -0.1035245 -0.3548322 -0.1230441 0.0000147 -0.179201 -0.0024603 0.0000109 0.0000019 0.0000109 -0.1021287 1.3667192 0.013224 -0.0000816 -0.0111644 0.1620273 0.0000044 -0.0000932 0.0000108 -0.0691874 -0.2231563 0.1399423 0.0000592 -0.080934 0.2077517 -0.0001519 -0.0003645 0.0002442 -0.1241677 0.1156521 0.0303733 -0.0001199 0.3547588 0.0792117 -0.0001286 0.0000566 0.000044 -0.137142 0.0586809 0.06954 0.0000116 0.0568056 0.0107946 -0.0000103 0.0000189 -0.0000061 0.1607391 0.075601 -0.0651066 0.0000027 -0.0454879 0.0241767 -0.0000013 0.0000077 -0.0000018 0.1592818 0.0458637 -0.0646986 0.0000046 -0.0670479 -0.0016077 -0.0000022 0.0000099 -0.0000062 0.1659326 0.0432987 0.0666345 0.0000078 0.0671386 0.0032597 -0.0000111 0.0000049 -0.0000144 0.1659388 0.083327 0.0186177 -0.0000237 0.0496904 0.068578 0.0000514 0.0001831 -0.0000448 0.2307041 -0.0000045 -0.0377085 0.0000404 -0.0833452 0.0956924 0.0000287 0.0000009 -0.0000758 0.1927048 unknown
polarizability: 215.6179543|-0.9013675|105.0610173|-0.0059072|-0.0070289|43.7475781 unknown
InChI: InChI=1S/C9H6ClNO/c10-8-3-1-7(2-4-8)9-11-5-6-12-9/h1-6H
charge 0 multiplicity 1
18 atoms
Cl 4.628265 0.0240 -0.00022
O  -2.180512 1.160824 0.000183
N  -2.272701 -1.130057 0.000039
C  -0.003151 -0.025845 0.000073
C  -1.460319 -0.071458 0.000166
C  0.699487 1.209807 0.000078
C  0.726855 -1.246749 -0.000033
C  2.108449 1.228563 -0.00002
C  2.13462 -1.235941 -0.000111
C  2.806473 0.004149 -0.000104
C  -3.537803 0.773917 -0.000351
C  -3.584928 -0.607406 0.000637
H  0.142365 2.151344 0.000154
H  0.177941 -2.193309 -0.000049
H  2.654181 2.176513 -0.000023
H  2.700153 -2.172145 -0.000185
H  -4.272301 1.57237 -0.000724
H  -4.452874 -1.260878 0.00099
