program: Gaussian 09
title: 000247861
version: EM64L-G09RevD.01
frameworkgroup: C1[X(C22H30Cl2O2)]
method: RPBEPBE
basis: SDD
operation: Freq
keyword: #p
keyword: freq=noraman
keyword: PBEPBE/SDD
title: #p freq=noraman PBEPBE/SDD
converged: NO YES NO NO
title: Mulliken charges:
elementType: Cl Cl O O C C C C C C C C C C C C C C C C C C C C C C H H H H H H H H H H H H H H H H H H H H H H H H H H H H H H
charge: -0.010423 0.021694 -0.274557 -0.251963 0.250247 -0.081492 -0.181603 -0.327583 -0.133161 -0.081778 0.393535 0.489114 -0.425710 -0.568517 -0.546676 -0.436000 -0.512544 -0.503108 -0.128598 -0.540907 -0.441508 -0.483157 -0.838609 -0.811252 0.272727 -0.761017 0.203369 0.245734 0.282744 0.206140 0.266747 0.245137 0.223886 0.224863 0.211495 0.211221 0.221747 0.211411 0.213303 0.221348 0.220956 0.271854 0.215367 0.230845 0.222958 0.237127 0.221067 0.235347 0.226649 0.223852 0.222365 0.230190 0.227286 0.248125 0.244545 0.245164
chargesum: 0.00000
title: Mulliken charges with hydrogens summed into heavy atoms:
elementType: Cl Cl O O C C C C C C C C C C C C C C C C C C C C C C
charge: -0.010423 0.021694 -0.274557 -0.251963 0.250247 0.121876 0.064131 -0.044839 0.072979 0.184969 0.393535 0.489114 -0.425710 -0.099493 -0.110317 -0.003032 -0.087830 -0.060804 0.143256 -0.094694 -0.218549 -0.024963 -0.152760 -0.131411 0.272727 -0.023182
polarizability: 3.18578502e+02 -4.06552529e+00 2.30066652e+02 2.90492348e+00 6.66985143e-01 2.00422472e+02
1716.lowfreq: -10.4376 -3.2104 -0.0016 -0.0016 0.0014 6.7739 21.1888 30.9816 37.5987
frequency: 21.1389 30.8866 37.5704 41.0001 50.1815 65.5932 76.0636 90.0387 110.4473 136.5421 154.7288 170.6910 174.5038 189.3645 194.3132 206.6369 231.9498 240.9009 249.0200 251.2342 261.6644 267.1494 277.0759 301.3004 311.2754 319.6621 339.3237 360.5067 384.1387 416.7452 421.9378 438.1695 446.3047 462.3455 470.7995 486.0474 509.9588 536.9061 542.4226 561.9452 588.3409 600.1071 632.2879 634.7650 654.1912 693.4651 710.3839 722.5212 741.6020 784.4422 795.7914 805.6695 823.0861 830.0210 849.0221 865.9397 874.3618 890.3972 904.3168 915.6615 941.6465 952.8359 960.3261 970.3124 974.1724 981.1164 987.3649 998.6204 1005.1039 1010.6544 1022.3492 1028.1008 1039.0478 1040.5917 1051.8130 1063.7073 1076.5093 1081.9901 1095.2571 1107.4312 1124.7839 1130.6654 1139.0767 1144.7562 1149.5508 1172.4351 1173.0252 1191.2237 1202.2663 1207.2839 1212.0560 1224.3326 1226.9681 1238.6151 1250.0918 1255.0639 1261.5548 1268.7825 1281.0766 1291.5509 1292.9091 1303.5245 1314.0108 1319.7915 1328.1361 1330.1384 1336.9972 1340.3583 1342.5837 1349.1926 1353.4975 1360.3160 1371.1263 1380.7207 1382.1321 1385.4739 1391.8545 1452.8162 1454.8528 1455.5165 1457.5962 1463.5452 1465.2395 1468.6786 1472.5134 1477.5137 1478.6861 1487.6594 1490.5500 1494.7269 1646.4486 1676.2570 2904.0988 2925.9334 2927.9484 2969.3640 2970.8567 2976.0585 2985.7351 2988.6208 2992.9425 2994.1373 2998.2472 3000.1715 3006.4063 3016.2784 3020.1073 3028.9539 3033.1187 3044.7698 3051.8890 3059.1025 3068.5822 3074.9632 3079.3673 3083.2166 3088.0534 3089.3051 3094.3022 3107.1509 3121.2931 3141.6957
redmass: 7.0815 8.6731 1.5984 2.2489 4.6300 3.0473 3.8227 8.1891 2.0020 2.9544 4.7933 1.9913 3.0156 2.5964 2.8152 3.4556 3.0404 2.7369 3.4285 2.6938 1.8909 2.5921 2.0635 3.1373 2.8537 3.1529 3.1854 2.6973 2.5582 3.7139 3.9306 3.4408 3.5816 3.9191 4.3267 3.0828 3.3183 2.9996 3.7067 3.3698 3.7886 3.1962 3.7342 4.0802 3.2840 2.7294 2.6468 2.2191 3.5586 3.4881 1.9798 2.4373 2.1106 1.9666 1.8394 2.5682 3.9890 1.9940 2.0054 1.7789 2.0890 1.9317 1.9896 2.7032 2.3234 2.5783 2.1249 2.0553 2.3411 1.8642 1.7749 1.8663 2.0061 1.6604 2.0675 2.0776 2.0744 2.1885 2.0735 1.6645 2.1593 3.0601 1.4186 1.9975 2.2198 2.0730 1.7427 1.5335 2.8627 2.0843 1.2278 1.5452 1.6545 1.3127 1.3778 1.4413 1.3987 1.4920 1.4398 1.3490 1.3878 1.4735 1.6777 1.4710 1.5781 1.3930 1.5574 1.4709 1.4162 1.5475 1.4471 1.5652 1.4389 2.2709 1.2491 1.2474 1.2371 1.0652 1.0897 1.0476 1.0730 1.0792 1.0844 1.0735 1.0670 1.0739 1.0730 1.0634 1.0780 1.0637 9.2067 7.9587 1.0808 1.0799 1.0680 1.0734 1.0686 1.0370 1.0595 1.0573 1.0525 1.0577 1.0613 1.0818 1.0367 1.0762 1.0717 1.0985 1.1008 1.1012 1.1016 1.1018 1.0983 1.0989 1.1010 1.1008 1.0909 1.0987 1.0973 1.0875 1.0902 1.1010
irintensity: 0.2835 1.7189 0.8838 0.8790 0.9318 1.2951 0.5019 0.6132 0.2548 0.8119 0.3558 1.4290 0.9709 0.1382 3.6876 1.8210 2.3301 0.6907 1.3180 4.2931 0.5701 0.4158 0.5049 0.9147 1.7226 1.2402 2.4551 0.9836 0.9044 2.1772 0.8175 1.1383 3.1436 1.3382 4.9673 1.9682 4.5040 5.5572 3.1309 3.4491 0.6271 1.1634 6.7414 41.8877 2.4641 2.8595 2.8457 0.4808 64.9160 4.8917 6.0644 12.4354 6.6817 7.9192 23.1083 2.3917 10.0565 9.1802 6.4585 0.7967 11.8017 4.4038 22.9805 16.2743 8.8554 9.2166 2.4019 95.1709 80.4281 15.2571 16.8715 3.4073 4.6784 10.7129 9.2243 1.8471 8.2631 4.4963 5.0101 0.9115 1.5403 13.2286 0.3954 7.3371 6.6880 0.2083 9.3967 6.1714 300.2234 59.2469 9.2889 6.9290 9.9359 2.7313 1.8703 6.7773 2.2220 6.5535 1.7395 1.6695 0.7491 3.0831 4.2330 0.7031 1.7320 3.9008 5.5275 2.1407 1.0205 1.3213 2.8792 0.8080 5.0480 7.1222 51.5359 11.3940 40.2676 23.7545 8.8410 19.1108 2.6541 8.2118 15.4777 13.5058 0.2894 7.0080 8.0618 2.4980 10.1044 10.3802 167.9047 3.2837 12.7234 9.2358 34.2416 12.5059 34.0994 21.3058 44.3007 5.2398 22.3741 12.0310 52.7938 51.3242 3.2572 22.7909 22.7464 29.1590 15.0852 62.2753 14.0123 23.9008 34.4423 37.8849 48.8509 26.3983 36.4623 32.5524 8.7261 1.7265 12.4681 11.5567
temp: 298.150 k
press: 1.00000 atm
elementType: 17 17 8 8 6 6 6 6 6 6 6 6 6 6 6 6 6 6 6 6 6 6 6 6 6 6 1 1 1 1 1 1 1 1 1 1 1 1 1 1 1 1 1 1 1 1 1 1 1 1 1 1 1 1 1 1
symmnumber: 1
zpe: 1237279.6 jmol-1
zpe.correction: 0.471255 hartree
zpe.thermalcorrener: 0.497117 hartree
zpe.thermalcorrenthalpy: 0.498061 hartree
zpe.thermalcorrgfe: 0.414835 hartree
zpe.sumelectzpe: -1924.885066 hartree
zpe.sumelectthermal: -1924.859204 hartree
zpe.sumelectthermalent: -1924.858259 hartree
zpe.sumelectthermalfe: -1924.941486 hartree
dipole: 2.2359 0.0817 -3.4236
dipole: 4.0899
quadrupole: -181.3129 -164.9820 -175.5224
quadrupole: 8.7612 0.5154 5.3961
quadrupole: -7.3738 8.9571 -1.5833 8.7612 0.5154 5.3961
hfenergy: -1925.3563206 hartree
pointgroup: C01 [X(C22H30Cl2O2)]
dipole: -0.8182051 0.3508037 -1.3403694 debye
polarizability: 318.1716277|-7.7158332|229.0125679|0.4894936|6.576844|201.8834307 unknown
InChI: InChI=1S/C22H30Cl2O2/c1-12(25)26-18-7-6-14-13-4-5-16-19-17(22(19,23)24)9-10-20(16,2)15(13)8-11-21(14,18)3/h5,13-15,17-19H,4,6-11H2,1-3H3
charge 0 multiplicity 1
56 atoms
Cl 4.612906 -0.587467 2.323496
Cl 6.908855 -1.014221 0.372587
O  -5.041729 0.131718 -0.089632
O  -5.14783 1.137077 2.022107
C  1.943908 0.793634 -0.321768
C  0.494967 0.401954 0.158249
C  -0.08917 -0.804416 -0.648131
C  4.295442 -0.295256 -0.60171
C  -1.519689 -1.104651 -0.158399
C  4.957048 1.036339 -0.107336
C  -2.492085 0.111707 -0.258995
C  2.803299 -0.474299 -0.481874
C  5.222402 -0.267207 0.614987
C  2.605496 1.701785 0.768148
C  -0.483484 1.614212 0.19303
C  4.056377 2.140754 0.446459
C  -1.925945 1.243106 0.628956
C  0.811749 -2.050833 -0.485397
C  -3.781306 -0.582481 0.270104
C  -2.311163 -2.281299 -0.792065
C  2.285118 -1.729471 -0.559855
C  -3.799537 -1.987124 -0.397389
C  1.926641 1.544696 -1.689251
C  -2.717506 0.601649 -1.713187
C  -5.62404 0.95933 0.877844
C  -6.894076 1.579489 0.333287
H  0.604836 0.041021 1.207337
H  -0.119911 -0.539711 -1.725572
H  4.754383 -0.77641 -1.473597
H  -1.427494 -1.330179 0.930806
H  5.815226 1.397558 -0.686382
H  2.579201 1.162885 1.732748
H  2.0001 2.619143 0.892752
H  -0.521988 2.09216 -0.804181
H  -0.096929 2.38267 0.888856
H  4.032087 2.946054 -0.312436
H  4.520068 2.578634 1.351797
H  -1.92276 0.908284 1.686356
H  -2.570163 2.142795 0.586121
H  0.553393 -2.807717 -1.253377
H  0.598299 -2.538044 0.49284
H  -3.740527 -0.644986 1.374142
H  -1.970332 -3.26262 -0.418338
H  -2.186192 -2.29122 -1.891329
H  2.974023 -2.581381 -0.663181
H  -4.460903 -1.961329 -1.281262
H  -4.206329 -2.747007 0.291917
H  2.946066 1.628099 -2.10666
H  1.313452 1.003096 -2.431438
H  1.523847 2.569376 -1.585251
H  -1.782854 0.960911 -2.17547
H  -3.128864 -0.192803 -2.360237
H  -3.441705 1.43543 -1.72019
H  -7.601162 0.789687 0.025965
H  -6.668189 2.183063 -0.563138
H  -7.356329 2.21501 1.102135
