program: Gaussian 09
title: 000247810
version: EM64L-G09RevD.01
frameworkgroup: C1[X(C14H12FN3O)]
method: RPBEPBE
basis: SDD
operation: Freq
keyword: #p
keyword: freq=noraman
keyword: PBEPBE/SDD
title: #p freq=noraman PBEPBE/SDD
converged: YES YES NO NO
title: Mulliken charges:
elementType: F O N N N C C C C C C C C C C C C C C H H H H H H H H H H H H
charge: -0.201135 -0.214249 0.017561 -0.424403 -0.000257 0.343763 0.079152 -0.337871 -0.319064 -0.799314 -0.387195 -0.372969 0.275321 0.330417 0.180027 -0.282668 -0.311821 -0.321926 -0.327977 0.218500 0.298745 0.256612 0.249580 0.233686 0.256277 0.260055 0.311669 0.272783 0.222988 0.248962 0.244751
chargesum: 0.00000
title: Mulliken charges with hydrogens summed into heavy atoms:
elementType: F O N N N C C C C C C C C C C C C C C
charge: -0.201135 -0.214249 0.017561 -0.112734 -0.000257 0.343763 0.079152 -0.119371 -0.020319 -0.059437 -0.130918 -0.112914 0.275321 0.330417 0.180027 -0.009885 -0.088833 -0.072964 -0.083226
polarizability: 3.50628484e+02 -9.47362779e+00 1.77179012e+02 4.55870392e+00 -7.53950363e+00 7.94990074e+01
1716.lowfreq: -2.6300 -0.0009 -0.0004 0.0001 4.4909 12.0166 22.7665 34.2369 38.8729
frequency: 22.7402 34.2087 38.8696 50.3007 72.6128 89.4575 113.8353 117.6673 175.3491 223.0958 237.9595 275.0785 322.7851 353.6260 365.0173 371.9594 382.3407 411.5034 423.6345 469.4528 488.6293 513.6499 550.1087 578.2617 614.5620 628.4425 649.3247 659.5124 690.1795 702.5572 725.3479 752.8614 801.0780 811.9370 835.9675 847.6452 881.5182 890.1576 939.5742 956.6787 957.4839 967.5142 987.7309 989.8503 1001.7297 1027.8495 1036.9025 1061.8240 1072.0547 1087.5827 1112.8464 1139.7998 1158.3125 1207.6921 1218.5789 1242.4070 1296.8076 1299.9713 1320.3567 1326.3538 1367.5363 1391.3745 1399.2565 1412.1351 1449.5938 1462.3284 1480.5405 1490.5180 1519.8240 1544.5063 1547.6183 1580.0141 1593.3689 1611.2957 1621.9755 2967.5825 3037.7640 3124.2733 3125.2942 3142.4207 3149.5000 3151.4376 3163.5249 3174.3994 3177.8737 3182.3436 3424.1833
redmass: 6.5410 3.8345 5.4675 3.6684 1.7729 2.7083 4.8323 7.0004 6.8015 6.6594 6.2278 6.4557 3.9194 5.6434 2.5455 5.3809 6.1880 3.0980 5.3403 4.5575 2.6938 4.8073 2.2982 5.5595 1.5309 7.1695 6.5980 6.6079 4.3471 4.6549 3.7816 2.9181 6.5128 1.3191 1.6422 1.4973 3.7953 1.2614 1.3648 2.5733 4.8099 2.0153 1.4455 1.3505 2.8043 1.5860 2.8275 2.0707 3.2769 1.6725 1.4362 2.7841 1.5524 2.0012 1.3368 3.1377 1.2781 6.3511 3.1154 1.6673 4.8345 1.2965 1.8515 3.9010 1.2923 1.6699 1.2483 1.9317 1.5492 6.9007 7.5642 5.6376 7.2970 6.4498 8.5027 1.0417 1.0978 1.0927 1.0875 1.0897 1.0972 1.0878 1.0889 1.0966 1.0961 1.0977 1.0746
irintensity: 0.0122 0.0431 1.2014 1.0726 2.8312 2.0458 1.0278 3.8689 8.3064 1.8131 9.1636 4.0924 1.2408 5.2871 0.3990 6.3203 1.6464 1.7630 8.4517 3.2121 0.4809 6.1134 43.6772 14.0890 49.4753 0.5257 13.0798 1.8253 34.0279 35.9368 1.6838 10.7341 16.5025 16.3875 32.6089 74.0381 16.8567 4.0330 0.2694 18.3499 6.1489 8.6928 1.4532 1.8161 8.1058 4.8011 3.7068 10.6190 4.3750 20.1868 35.9549 118.7028 60.5366 43.8353 22.9599 216.0051 2.4768 0.3204 59.1845 20.5553 0.0770 23.9713 14.0519 14.2915 159.4574 12.5406 142.8018 164.8609 40.5591 15.2282 22.1336 12.6446 12.6611 66.4258 172.3472 11.9116 14.4237 14.4828 8.4143 29.4189 14.6567 11.7048 0.4734 5.9799 5.3572 6.3616 11.7036
temp: 298.150 k
press: 1.00000 atm
elementType: 9 8 7 7 7 6 6 6 6 6 6 6 6 6 6 6 6 6 6 1 1 1 1 1 1 1 1 1 1 1 1
symmnumber: 1
zpe: 609351.5 jmol-1
zpe.correction: 0.232090 hartree
zpe.thermalcorrener: 0.248869 hartree
zpe.thermalcorrenthalpy: 0.249813 hartree
zpe.thermalcorrgfe: 0.184968 hartree
zpe.sumelectzpe: -878.643928 hartree
zpe.sumelectthermal: -878.627149 hartree
zpe.sumelectthermalent: -878.626204 hartree
zpe.sumelectthermalfe: -878.691049 hartree
dipole: -0.1950 5.1788 0.8208
dipole: 5.2471
quadrupole: -136.4943 -100.5262 -112.0288
quadrupole: -6.3612 0.8096 -2.7251
quadrupole: -20.1445 15.8236 4.3210 -6.3612 0.8096 -2.7251
hfenergy: -878.8760178 hartree
pointgroup: C01 [X(C14H12F1N3O1)]
dipole: 0.0882066 -2.0464618 0.2566242 debye
polarizability: 350.5382763|-8.4863211|176.5255196|-8.2503731|10.7278223|80.2427073 unknown
InChI: InChI=1S/C14H12FN3O/c1-10(11-2-4-13(15)5-3-11)17-18-14(19)12-6-8-16-9-7-12/h2-9,18H,1H3
charge 0 multiplicity 1
31 atoms
F  6.685229 0.861204 -0.223779
O  -1.678553 2.060852 0.037344
N  0.357427 0.135492 0.039831
N  -0.985649 -0.186668 0.103793
N  -6.123819 -0.469634 0.022164
C  2.67306 -0.41627 0.084933
C  1.249597 -0.83456 0.192131
C  3.734265 -1.360442 0.007012
C  2.997573 0.974328 0.047376
C  0.866768 -2.284033 0.456531
C  5.078564 -0.942496 -0.09921
C  4.330639 1.407496 -0.054317
C  -3.3782 0.3271 0.030546
C  5.346797 0.434858 -0.124016
C  -1.954418 0.832516 0.047265
C  -4.393447 1.197057 0.4999
C  -3.770331 -0.943564 -0.465628
C  -5.734753 0.759202 0.48284
C  -5.140375 -1.291742 -0.449033
H  3.530004 -2.435412 0.010913
H  2.179358 1.697859 0.098978
H  1.725436 -2.881926 0.791175
H  0.454568 -2.768482 -0.451232
H  0.10418 -2.355877 1.257257
H  5.899205 -1.662388 -0.163675
H  4.587325 2.470417 -0.077768
H  -1.300983 -1.156474 0.236001
H  -4.121972 2.194231 0.858508
H  -3.050032 -1.644807 -0.902579
H  -6.540059 1.40626 0.846913
H  -5.474603 -2.261893 -0.83367
