program: Gaussian 09
title: 000247788
version: EM64L-G09RevD.01
frameworkgroup: C1[X(C13H10Cl2N2O3S)]
method: RPBEPBE
basis: SDD
operation: Freq
keyword: #p
keyword: freq=noraman
keyword: PBEPBE/SDD
title: #p freq=noraman PBEPBE/SDD
converged: YES YES NO NO
title: Mulliken charges:
elementType: Cl Cl S O O O N N C C C C C C C C C C C C C H H H H H H H H H H
charge: -0.006672 0.003519 0.993535 -0.569730 -0.508063 -0.505913 -0.433262 0.012091 -0.096375 0.505046 -0.196207 -0.193282 -0.401297 -0.341058 0.500341 -0.341633 -0.393419 -0.398480 -0.070416 -0.197343 -0.102697 0.282359 0.280808 0.234711 0.281587 0.283506 0.287641 0.234555 0.213401 0.261875 0.380874
chargesum: 0.00000
title: Mulliken charges with hydrogens summed into heavy atoms:
elementType: Cl Cl S O O O N N C C C C C C C C C C C C C
charge: -0.006672 0.003519 0.993535 -0.188857 -0.508063 -0.505913 -0.149756 0.012091 -0.096375 0.505046 0.086152 0.087525 -0.166586 -0.059471 0.500341 -0.053992 -0.158864 -0.185079 -0.070416 0.064532 -0.102697
polarizability: 5.01344317e+02 4.81115488e+00 2.25946754e+02 -1.17445503e+00 -1.05102462e+00 9.61900717e+01
1716.lowfreq: -5.8037 0.0007 0.0009 0.0015 2.2965 3.7494 16.2869 21.5631 26.6343
frequency: 16.0359 21.5550 26.6301 44.6980 55.5336 95.2423 100.5962 146.4737 150.9313 165.2720 173.8512 180.4685 189.8573 213.6374 256.0866 260.6989 277.3299 297.1481 309.4702 353.6880 356.2973 371.6731 392.6239 416.0023 416.4374 438.0515 442.9976 466.3715 511.9207 549.6985 570.8498 578.5102 614.7680 618.0084 654.8628 662.5001 703.3515 705.0428 728.1456 817.3061 823.9391 827.3768 836.0109 849.6702 900.5246 922.1912 925.5388 955.5648 961.7681 965.3381 983.0609 986.9294 1001.8841 1044.0658 1056.3410 1093.1292 1114.8412 1126.3305 1149.7305 1176.9734 1222.1759 1255.1280 1284.0585 1292.2844 1329.8571 1367.8436 1396.1859 1400.0184 1424.3046 1458.8459 1476.3253 1531.0997 1549.3707 1578.8446 1595.1914 1600.0950 1606.1067 2984.8014 3132.2308 3137.7881 3162.2348 3168.7524 3172.4611 3176.9755 3196.0209 3394.2727 3479.1401
redmass: 9.1925 10.2971 12.8294 4.0369 8.4318 9.3769 7.5735 6.8908 7.7821 3.2438 2.2099 5.3861 12.7150 4.5578 4.4037 7.2190 3.7140 7.6280 7.4044 9.5338 6.1013 6.2543 7.7491 2.9810 10.5045 5.7204 3.1437 8.3867 3.6613 6.0633 7.2036 3.9370 1.3497 7.1209 6.8767 7.1412 6.5096 3.3621 3.3624 1.3412 1.3572 8.0133 7.0165 1.5160 1.4101 4.4141 1.5485 1.4101 1.5804 6.0770 4.1354 1.4070 4.8841 1.3227 2.0242 3.6196 1.9686 1.5833 1.4881 1.1221 1.8832 1.3842 1.5907 1.7868 1.9206 4.2118 4.2995 3.3525 4.4951 2.8227 2.2857 2.2980 7.8863 6.3088 6.7986 5.1412 5.3234 1.0871 1.0900 1.0897 1.0910 1.0957 1.0953 1.0927 1.0948 1.0749 1.0661
irintensity: 0.9963 0.4247 0.5668 1.6414 0.2358 0.4455 0.0492 1.3562 2.5532 22.2967 32.2886 1.7258 2.1583 19.1238 11.4953 16.5031 45.4644 30.6585 40.0697 7.1433 3.2522 2.7751 0.5687 0.8092 62.1970 14.2834 7.7120 39.9617 55.8049 144.0911 90.9016 0.6279 65.1016 6.1796 51.5864 5.8687 28.2401 4.7205 0.4246 22.3509 36.7777 88.4317 34.1763 55.8055 0.5494 6.5220 52.6843 5.7692 16.8819 76.3362 12.8686 1.5244 31.8196 49.2854 149.2674 183.8435 63.7595 33.8682 29.7934 34.4527 16.4571 1.8450 212.8300 106.8014 25.5267 12.6906 22.6011 55.7579 10.1509 76.0679 105.2052 134.5118 110.8424 150.7389 9.6445 85.4893 371.0777 55.6495 9.8035 8.3392 1.2712 4.6912 4.2189 1.1672 1.2104 4.0385 42.0192
temp: 298.150 k
press: 1.00000 atm
elementType: 17 17 16 8 8 8 7 7 6 6 6 6 6 6 6 6 6 6 6 6 6 1 1 1 1 1 1 1 1 1 1
symmnumber: 1
zpe: 540857.1 jmol-1
zpe.correction: 0.206002 hartree
zpe.thermalcorrener: 0.226552 hartree
zpe.thermalcorrenthalpy: 0.227496 hartree
zpe.thermalcorrgfe: 0.153271 hartree
zpe.sumelectzpe: -2153.031890 hartree
zpe.sumelectthermal: -2153.011340 hartree
zpe.sumelectthermalent: -2153.010396 hartree
zpe.sumelectthermalfe: -2153.084621 hartree
dipole: -3.7164 -6.5686 1.4276
dipole: 7.6809
quadrupole: -181.9646 -125.9052 -150.4600
quadrupole: 6.9343 12.6712 3.5332
quadrupole: -29.1880 26.8714 2.3166 6.9343 12.6712 3.5332
hfenergy: -2153.237892 hartree
pointgroup: C01 [X(C13H10Cl2N2O3S1)]
dipole: 1.58463 2.5304777 0.4663561 debye
polarizability: 501.187982|-8.1953778|226.0167353|-0.0650049|-3.5642219|96.2764257 unknown
InChI: InChI=1S/C13H10Cl2N2O3S/c14-12-6-1-9(7-13(12)15)8-16-17-10-2-4-11(5-3-10)21(18,19)20/h1-8,17-18H
charge 0 multiplicity 1
31 atoms
Cl 4.545752 -3.035472 0.071794
Cl 7.364539 -1.34412 0.071556
S  -5.781483 -0.782776 -0.053523
O  -5.98245 -0.879554 1.796642
O  -6.864439 0.276233 -0.626008
O  -5.721545 -2.294033 -0.630884
N  -0.290279 1.728016 -0.052601
N  0.855944 0.975879 -0.027776
C  -4.089565 -0.02277 -0.040674
C  -1.553818 1.120373 -0.047851
C  -3.992299 1.379525 -0.07123
C  -2.969714 -0.873903 -0.011391
C  -2.709412 1.95257 -0.079312
C  -1.688874 -0.2967 -0.019416
C  3.282572 0.8712 -0.004912
C  3.31961 -0.551601 0.019015
C  4.509654 1.590272 -0.00493
C  2.015495 1.605746 -0.029462
C  4.5499 -1.225037 0.042233
C  5.741952 0.909233 0.018423
C  5.76664 -0.500856 0.042144
H  -4.893687 1.998896 -0.104522
H  -3.099209 -1.96053 0.000845
H  -2.604048 3.043548 -0.106756
H  -0.790689 -0.91658 -0.000641
H  -0.240915 2.757242 -0.072883
H  2.382116 -1.113772 0.018845
H  4.502867 2.686039 -0.023122
H  2.081744 2.711933 -0.049243
H  6.686407 1.460656 0.018433
H  -6.865765 -1.315758 1.977807
