program: Gaussian 09
title: 000247791
version: EM64L-G09RevD.01
frameworkgroup: C1[X(C17H14N2O3S)]
method: RPBEPBE
basis: SDD
operation: Freq
keyword: #p
keyword: freq=noraman
keyword: PBEPBE/SDD
title: #p freq=noraman PBEPBE/SDD
converged: YES YES NO NO
title: Mulliken charges:
elementType: S O O O N N C C C C C C C C C C C C C C C C C H H H H H H H H H H H H H H
charge: 0.991711 -0.570670 -0.510662 -0.509084 -0.437673 0.009607 0.220422 0.408127 0.296249 -0.366154 -0.438311 -0.386316 -0.420674 -0.239065 -0.098995 0.501346 -0.393301 -0.254890 -0.245856 -0.195837 -0.195520 -0.402085 -0.343097 0.210355 0.242133 0.262494 0.240166 0.232327 0.197673 0.229345 0.232653 0.280126 0.279454 0.233632 0.281646 0.279552 0.379171
chargesum: 0.00000
title: Mulliken charges with hydrogens summed into heavy atoms:
elementType: S O O O N N C C C C C C C C C C C C C C C C C
charge: 0.991711 -0.191499 -0.510662 -0.509084 -0.158120 0.009607 0.220422 0.408127 0.296249 -0.155799 -0.196178 -0.123822 -0.180508 -0.006737 -0.098995 0.501346 -0.195628 -0.025545 -0.013203 0.084289 0.083935 -0.168454 -0.061451
polarizability: 5.73213253e+02 -8.50747246e-01 2.50442028e+02 -1.55526114e+00 -5.92667598e-01 1.06979784e+02
1716.lowfreq: -0.0002 0.0019 0.0020 2.9659 4.8814 11.5840 18.4441 23.7956 35.0573
frequency: 17.3775 23.7743 35.0194 47.2637 62.2982 104.0776 105.0671 133.2800 153.0715 171.1290 177.8521 192.1749 198.0715 217.1759 260.6598 283.9200 292.6367 311.8612 336.1658 366.9850 369.9662 417.2248 420.6561 426.0676 432.1607 474.1719 497.0013 503.4580 511.6650 542.6484 552.7103 561.4438 601.4321 616.4307 642.3156 650.0389 663.6377 726.4723 744.2079 754.7083 786.0327 788.3142 814.7665 820.8428 829.5626 839.1202 849.1453 881.5203 891.6729 913.4318 937.6331 959.9052 962.7018 964.7313 982.1008 986.9369 991.6427 997.8075 1014.3473 1037.5100 1042.8939 1055.1652 1091.0889 1098.9323 1125.8125 1154.0400 1176.3060 1178.0637 1190.0943 1237.4258 1253.1762 1274.1793 1284.0711 1298.5222 1337.4670 1368.8235 1400.8981 1406.6166 1415.6488 1427.8141 1442.0757 1455.9484 1475.4116 1515.2995 1532.2419 1554.6824 1587.6419 1590.8560 1596.8542 1605.5955 1630.5533 3010.2011 3124.1188 3127.8121 3132.0132 3132.5867 3148.5803 3149.3759 3161.5536 3165.5289 3167.8046 3168.2222 3195.8878 3388.6662 3479.5305
redmass: 6.0203 7.7623 6.8405 3.9687 5.4779 5.3608 7.0450 8.7370 3.8769 1.7182 4.1804 4.4517 4.6199 3.3952 6.5504 3.4130 6.5334 4.7831 7.2931 7.3042 7.1874 2.9806 8.8923 2.9913 4.5272 3.2542 6.8280 6.3784 3.7617 6.0116 2.7803 7.1447 1.3224 7.0445 6.4179 3.1873 6.6564 3.3169 1.3345 5.5689 5.3924 1.8332 1.4610 1.3668 10.5226 5.2620 1.5080 1.8532 4.0293 1.5789 1.4186 1.4421 1.4043 9.5761 4.3703 1.3781 1.3437 1.3884 4.3090 2.2774 1.2917 2.0913 2.1705 2.9048 1.5172 1.4189 1.1154 1.1034 1.2347 1.8792 1.7504 1.8896 1.4914 1.7979 1.7037 2.6547 3.5059 2.6855 4.8366 4.5905 2.5345 2.3795 2.2573 3.2699 2.7032 5.3920 7.1782 5.2952 4.9938 5.7986 6.3565 1.0857 1.0861 1.0871 1.0898 1.0877 1.0928 1.0938 1.0909 1.1004 1.0958 1.0975 1.0946 1.0748 1.0661
irintensity: 0.5500 0.8309 0.7640 2.2953 0.1832 0.5398 0.9940 0.3438 1.3517 47.9058 0.7864 17.8713 10.5922 15.4465 11.9149 58.9689 11.9294 8.3330 58.6938 0.4195 31.0756 0.2827 51.3386 10.5184 9.4750 1.6322 2.1228 0.7061 55.1090 42.8387 12.4762 237.4229 47.5965 11.4594 16.1586 0.2054 47.7820 0.1609 7.2484 2.5211 4.0705 87.9764 33.7791 31.0512 100.8582 25.0821 59.7299 7.2606 2.0623 27.6291 3.9885 7.9286 2.1392 85.2291 20.5252 1.2167 0.5272 2.8131 35.1963 2.5901 52.0534 180.0735 44.7276 94.3945 73.6157 9.4964 43.0720 0.3025 0.9760 3.6343 10.9029 23.1494 140.6488 181.1300 2.4772 17.8211 18.3193 1.8192 3.0492 6.8542 2.3436 0.2568 100.9227 12.9209 212.1723 67.0879 20.0502 6.3503 27.6445 620.3797 0.4338 41.3833 3.0772 0.9281 9.9841 1.3837 1.9720 59.2390 1.0252 41.7123 4.4757 10.1041 1.1838 9.8924 40.0304
temp: 298.150 k
press: 1.00000 atm
elementType: 16 8 8 8 7 7 6 6 6 6 6 6 6 6 6 6 6 6 6 6 6 6 6 1 1 1 1 1 1 1 1 1 1 1 1 1 1
symmnumber: 1
zpe: 712998.8 jmol-1
zpe.correction: 0.271567 hartree
zpe.thermalcorrener: 0.292217 hartree
zpe.thermalcorrenthalpy: 0.293161 hartree
zpe.thermalcorrgfe: 0.219952 hartree
zpe.sumelectzpe: -1387.640643 hartree
zpe.sumelectthermal: -1387.619992 hartree
zpe.sumelectthermalent: -1387.619048 hartree
zpe.sumelectthermalfe: -1387.692258 hartree
dipole: -7.4116 -2.7551 1.2884
dipole: 8.0114
quadrupole: -158.4005 -123.7338 -151.7385
quadrupole: -2.4056 12.9567 1.7517
quadrupole: -13.7762 20.8904 -7.1142 -2.4056 12.9567 1.7517
hfenergy: -1387.9122096 hartree
pointgroup: C01 [X(C17H14N2O3S1)]
dipole: -2.8985644 1.1727154 -0.3971943 debye
polarizability: 573.1046246|-3.367039|248.4347884|6.3064788|16.9332649|109.0956515 unknown
InChI: InChI=1S/C17H14N2O3S/c20-23(21,22)16-10-8-15(9-11-16)19-18-12-14-6-3-5-13-4-1-2-7-17(13)14/h1-12,19-20H
charge 0 multiplicity 1
37 atoms
S  6.487562 -0.368425 0.150738
O  6.753503 -0.17142 -1.685061
O  7.373976 0.756396 0.907552
O  6.662299 -1.936374 0.515976
N  0.658906 1.193609 0.229559
N  -0.345162 0.264931 0.0858
C  -4.095041 0.261318 -0.011551
C  -5.174374 -0.702513 -0.145802
C  -2.724312 -0.224574 -0.02205
C  -4.450355 1.646689 0.122882
C  -4.873411 -2.095411 -0.286982
C  -2.483196 -1.607855 -0.164528
C  -6.535576 -0.24817 -0.136986
C  -3.54721 -2.538086 -0.296962
C  4.696812 0.104477 0.162903
C  2.003843 0.809442 0.203091
C  -1.593253 0.699443 0.115844
C  -5.785396 2.059327 0.127596
C  -6.842086 1.10547 -0.002838
C  4.365701 1.45993 0.342122
C  3.73417 -0.909271 0.000219
C  3.005793 1.810422 0.366141
C  2.375725 -0.55467 0.02519
H  -3.672705 2.410334 0.223091
H  -5.700295 -2.808194 -0.38716
H  -1.445578 -1.955005 -0.168591
H  -7.335331 -0.991328 -0.239105
H  -3.321633 -3.604152 -0.405431
H  -1.807507 1.775522 0.249309
H  -6.02668 3.122923 0.231707
H  -7.884223 1.442013 0.002469
H  5.149666 2.211476 0.47548
H  4.044306 -1.951209 -0.125943
H  2.719565 2.859074 0.509045
H  1.592695 -1.305741 -0.092826
H  0.434036 2.191137 0.360124
H  7.708462 -0.408434 -1.872626
