program: Gaussian 09
title: 000247775
version: EM64L-G09RevD.01
frameworkgroup: C1[X(C10H24N2S)]
method: RPBEPBE
basis: SDD
operation: Freq
keyword: #p
keyword: freq=noraman
keyword: PBEPBE/SDD
title: #p freq=noraman PBEPBE/SDD
converged: YES YES NO NO
title: Mulliken charges:
elementType: S N N C C C C C C C C C C H H H H H H H H H H H H H H H H H H H H H H H H
charge: 0.143233 -0.081171 -0.095757 -0.363597 -0.394772 -0.323037 -0.341603 -0.657044 -0.628095 -0.625056 -0.613960 -0.624920 -0.606573 0.231252 0.218669 0.221647 0.219429 0.169794 0.203544 0.190621 0.206515 0.244997 0.244456 0.273094 0.239530 0.183239 0.219209 0.237807 0.221792 0.184856 0.224172 0.237011 0.188669 0.220482 0.223817 0.220766 0.186985
chargesum: 0.00000
title: Mulliken charges with hydrogens summed into heavy atoms:
elementType: S N N C C C C C C C C C C
charge: 0.143233 -0.081171 -0.095757 0.086324 0.046304 0.050301 0.055533 -0.167592 -0.115472 0.015198 0.016861 0.021242 0.024995
polarizability: 1.91800655e+02 1.11501087e+00 1.26521862e+02 2.66195077e+00 -3.10956885e+00 1.16413708e+02
1716.lowfreq: -10.4839 -2.3157 -0.0013 -0.0008 0.0019 7.6654 10.8947 17.2758 37.3798
frequency: 9.9909 16.8778 37.3354 48.8792 51.1778 71.7272 84.6285 103.2350 125.7428 148.7580 186.4285 211.2236 223.5848 232.9770 242.2061 266.6551 287.3229 302.0153 331.8992 340.7214 356.0776 414.2085 431.9496 474.6335 517.3458 696.5059 719.2685 742.2416 760.8892 804.3621 822.5801 846.9277 886.1083 944.4866 1015.1114 1017.7950 1030.1128 1033.9994 1035.5292 1042.6705 1059.7387 1073.7829 1085.7339 1092.6091 1095.7582 1115.5401 1118.4563 1134.0833 1152.0364 1199.6207 1212.5683 1229.8797 1248.0852 1257.0863 1265.1356 1271.7158 1281.5312 1286.6314 1295.2913 1320.9929 1349.7312 1364.4493 1372.8111 1416.6995 1417.3320 1439.2374 1440.7366 1452.5042 1457.7061 1458.7475 1460.8382 1461.5032 1464.3473 1473.9157 1474.6671 1475.1158 1477.4477 1481.8987 1484.2393 1487.6333 1488.1297 2814.6461 2825.0702 2838.0357 2843.4396 2855.2469 2860.0015 2990.0499 2993.2162 2995.5655 3006.3387 3006.8894 3009.3369 3016.6056 3016.6488 3028.0978 3029.9941 3044.9463 3047.0978 3074.0789 3075.7140 3076.3360 3084.6347 3088.3216 3088.7184
redmass: 3.2017 2.8499 3.4923 2.9027 3.2776 2.9179 2.5572 2.4462 2.1979 2.8632 2.7656 1.3569 1.1798 1.1498 1.2666 1.9193 2.4396 2.7744 2.6091 2.5408 2.0218 2.0907 2.3701 2.9391 3.3985 5.1574 3.3203 2.2108 1.1078 1.6179 4.3095 1.2555 1.8176 2.0360 1.7417 2.0338 1.4936 1.4985 1.4705 2.7573 2.4533 2.1715 1.3584 1.3560 2.0212 1.4556 1.2966 1.4645 1.6555 1.4039 1.7571 1.6469 1.5855 1.7983 2.1787 1.2862 1.3562 1.3781 1.1798 1.4081 1.4360 1.3407 1.3993 1.1413 1.1420 1.1634 1.1678 1.0850 1.0585 1.0656 1.0590 1.0548 1.0771 1.0913 1.0562 1.0642 1.0550 1.0744 1.0647 1.0630 1.0714 1.0701 1.0701 1.0578 1.0574 1.0578 1.0578 1.0574 1.0614 1.0654 1.0776 1.0766 1.0692 1.0715 1.0718 1.0719 1.0715 1.0995 1.1041 1.1061 1.1011 1.1020 1.1006 1.1011 1.1057
irintensity: 0.8047 0.2036 0.6048 0.5538 1.5822 0.1961 0.3517 0.9545 0.9644 0.7737 0.1697 1.3485 1.0240 0.8356 0.0636 1.6310 2.2674 7.7323 9.2011 2.7328 3.1023 0.5989 1.0301 4.5729 5.5551 11.3411 3.1430 15.7022 7.1407 5.3070 23.3973 1.2095 4.1110 10.6476 6.2660 24.0096 16.0360 19.5008 6.1000 7.1703 6.1702 17.3644 6.3153 6.3240 15.5727 7.7902 7.0009 4.7241 7.5321 8.4903 6.4998 12.5961 16.3317 4.3759 6.4064 4.8781 15.3687 5.6943 5.4416 18.4447 2.6005 8.0352 16.2130 2.8390 2.7170 5.1779 2.0288 11.2583 5.3782 6.1784 7.2237 19.3561 15.1716 14.8566 11.6345 3.4606 14.2536 7.8642 11.4144 14.3535 20.7615 74.3924 76.9468 72.7610 73.5830 239.3695 272.3606 11.1048 19.8871 14.6146 48.2282 13.6730 37.0156 35.0325 58.8295 34.3829 45.5664 27.1925 0.6227 38.0775 27.7259 70.2591 48.0509 39.7784 27.9406
temp: 298.150 k
press: 1.00000 atm
elementType: 16 7 7 6 6 6 6 6 6 6 6 6 6 1 1 1 1 1 1 1 1 1 1 1 1 1 1 1 1 1 1 1 1 1 1 1 1
symmnumber: 1
zpe: 866223.1 jmol-1
zpe.correction: 0.329927 hartree
zpe.thermalcorrener: 0.348269 hartree
zpe.thermalcorrenthalpy: 0.349213 hartree
zpe.thermalcorrgfe: 0.279431 hartree
zpe.sumelectzpe: -901.862880 hartree
zpe.sumelectthermal: -901.844537 hartree
zpe.sumelectthermalent: -901.843593 hartree
zpe.sumelectthermalfe: -901.913376 hartree
dipole: -1.2239 1.9718 0.3424
dipole: 2.3459
quadrupole: -77.5993 -94.1565 -90.0364
quadrupole: 3.8666 3.2324 -1.2599
quadrupole: 9.6648 -6.8924 -2.7724 3.8666 3.2324 -1.2599
hfenergy: -902.1928065 hartree
pointgroup: C01 [X(C10H24N2S1)]
dipole: 0.4848876 0.7808344 -0.0839199 debye
polarizability: 191.7533607|-1.5349026|126.1150287|3.0930421|3.6832779|116.8678362 unknown
InChI: InChI=1S/C10H24N2S/c1-11(2)7-5-9-13-10-6-8-12(3)4/h5-10H2,1-4H3
charge 0 multiplicity 1
37 atoms
S  0.129469 -1.38388 0.019929
N  -4.987155 0.141846 0.083178
N  4.44409 0.682562 -0.105895
C  -2.542881 -0.49756 0.00026
C  2.935162 -1.331126 0.202715
C  -3.58873 0.626291 0.176482
C  4.262013 -0.626676 0.567427
C  -1.125757 0.002091 0.330311
C  1.709487 -0.454595 0.505973
C  -5.336597 -0.384416 -1.252124
C  -5.951201 1.167847 0.531575
C  4.571997 0.571927 -1.573153
C  5.55706 1.454057 0.48349
H  -2.813887 -1.337803 0.666445
H  -2.55596 -0.880834 -1.037695
H  2.92948 -1.621018 -0.865309
H  2.877529 -2.273392 0.7821
H  -3.383028 1.44188 -0.569378
H  -3.462397 1.07343 1.182425
H  5.11057 -1.326632 0.342292
H  4.280115 -0.441247 1.659395
H  -1.048516 0.302359 1.391225
H  -0.844812 0.861734 -0.30605
H  1.756175 0.487053 -0.066138
H  1.654201 -0.213445 1.583029
H  -5.240636 0.381243 -2.06575
H  -6.381748 -0.742025 -1.241918
H  -4.692577 -1.241563 -1.509841
H  -6.971336 0.743425 0.533909
H  -5.961772 2.084191 -0.1141
H  -5.709415 1.480559 1.563285
H  3.666344 0.114641 -2.006745
H  5.455278 -0.039528 -1.892579
H  4.679778 1.581298 -2.008823
H  5.384182 1.590926 1.566072
H  5.605913 2.454015 0.015929
H  6.556767 0.964863 0.352558
