program: Gaussian 09
title: 000247777
version: EM64L-G09RevD.01
frameworkgroup: C1[X(C11H14O3)]
method: RPBEPBE
basis: SDD
operation: Freq
keyword: #pfreq=noraman
keyword: PBEPBE/SDD
title: #p freq=noraman PBEPBE/SDD
converged: YES YES NO NO
title: Mulliken charges:
elementType: O O O C C C C C C C C C C C H H H H H H H H H H H H H H
charge: -0.274200 -0.220676 -0.230947 0.099445 0.498835 0.161660 -0.737396 -0.556011 0.499669 -0.559533 -0.811329 -0.806862 0.306233 -0.763850 0.228094 0.266582 0.235799 0.236402 0.258546 0.229274 0.230615 0.252997 0.231481 0.239784 0.234572 0.244639 0.264164 0.242013
chargesum: 0.00000
title: Mulliken charges with hydrogens summed into heavy atoms:
elementType: O O O C C C C C C C C C C C
charge: -0.274200 -0.220676 -0.230947 0.099445 0.498835 0.161660 -0.006922 -0.319610 0.499669 -0.300986 -0.098443 -0.101025 0.306233 -0.013033
polarizability: 1.57882991e+02 2.15859405e+00 1.29558994e+02 -1.04287667e+01 -2.99004798e+00 1.03148016e+02
1716.lowfreq: -11.0875 -4.9420 -0.0008 -0.0008 -0.0004 10.0673 38.6425 72.9428 76.2856
frequency: 38.5236 72.9309 76.2787 85.8013 121.8263 124.4228 132.1099 172.9804 202.8599 225.2772 236.1960 254.1039 265.2431 277.7469 318.3675 341.4768 361.7164 459.7869 489.5630 522.0846 549.6274 557.3123 586.5336 588.2412 606.6202 710.6800 726.5609 828.9348 854.2139 870.5516 879.1235 927.7515 947.2964 990.9434 996.7108 1021.3320 1031.3377 1040.2309 1044.5372 1050.5685 1101.7612 1115.7571 1165.0623 1210.7407 1230.6394 1259.5952 1328.2090 1373.8876 1381.3731 1383.9663 1394.0972 1396.5992 1452.3545 1453.1554 1453.7572 1458.5212 1460.5607 1461.6848 1464.5275 1471.1377 1568.8236 1583.0670 1643.9555 1658.1648 2972.9699 2976.3004 2997.7210 3006.2024 3047.3861 3050.3315 3090.9263 3098.8789 3099.0283 3106.3168 3108.3099 3116.5007 3139.7459 3149.0951
redmass: 4.3321 1.5560 3.2928 2.1158 1.6883 1.4400 1.7913 2.6155 2.3515 1.2897 2.9236 2.7979 2.0896 3.1946 4.6756 4.7341 4.3221 3.9358 5.8379 3.3577 3.6718 4.3796 3.6299 3.4489 4.0729 3.2279 5.4012 3.0829 1.3997 2.4563 1.4363 3.4198 2.7073 2.1272 1.7918 1.4732 1.9446 1.6646 1.6046 2.3982 1.9950 2.8565 2.1423 4.0648 2.0413 3.9425 1.9296 1.4343 1.2371 1.6842 1.3724 1.2209 1.0576 1.0554 1.0587 1.0651 1.0907 1.0527 1.0852 1.0631 9.2897 6.4689 9.8854 6.5781 1.0381 1.0371 1.0334 1.0376 1.0963 1.0956 1.0994 1.0984 1.0950 1.1010 1.1011 1.0914 1.1022 1.0924
irintensity: 3.0532 2.2942 3.8030 0.7232 1.8921 0.1685 0.0215 1.3081 3.1970 0.5076 1.7805 2.3253 1.7147 4.3451 2.1982 5.8560 4.7972 4.0011 4.3127 2.4680 3.9525 0.9581 6.6273 8.8853 1.5951 2.3389 10.2831 9.6534 23.9991 12.4301 2.8095 34.4784 3.6129 77.4245 16.7322 0.9027 40.6403 8.6845 13.7216 10.6709 4.7985 26.6132 16.8201 209.8703 7.3743 21.7005 4.0000 13.2753 53.6358 17.9005 41.1839 15.5919 28.7403 16.7136 16.5108 15.3890 5.0679 11.5102 10.2918 28.3388 189.0785 43.1752 172.7080 60.2601 16.4524 20.8083 13.3184 2.0632 14.0318 15.3985 18.2740 17.7417 6.8437 14.1914 8.7395 22.1858 8.5949 5.6175
temp: 298.150 k
press: 1.00000 atm
elementType: 8 8 8 6 6 6 6 6 6 6 6 6 6 6 1 1 1 1 1 1 1 1 1 1 1 1 1 1
symmnumber: 1
zpe: 586286.9 jmol-1
zpe.correction: 0.223305 hartree
zpe.thermalcorrener: 0.238660 hartree
zpe.thermalcorrenthalpy: 0.239604 hartree
zpe.thermalcorrgfe: 0.181091 hartree
zpe.sumelectzpe: -652.177336 hartree
zpe.sumelectthermal: -652.161981 hartree
zpe.sumelectthermalent: -652.161037 hartree
zpe.sumelectthermalfe: -652.219550 hartree
dipole: 1.3804 3.9325 0.6320
dipole: 4.2154
quadrupole: -66.5157 -85.7530 -85.7143
quadrupole: -2.0055 -0.4862 1.4781
quadrupole: 12.8120 -6.4253 -6.3866 -2.0055 -0.4862 1.4781
hfenergy: -652.4006412 hartree
pointgroup: C01 [X(C11H14O3)]
dipole: -0.5036275 -1.5328366 0.3837637 debye
polarizability: 158.7181707|3.3164211|129.9291104|7.3202899|1.0684153|101.9427196 unknown
InChI: InChI=1S/C11H14O3/c1-7-5-8(2)11(4,10(13)6-7)14-9(3)12/h5-6H,1-4H3
charge 0 multiplicity 1
28 atoms
O  1.81193 -0.13998 0.39843
O  0.415126 2.310154 0.474176
O  1.231106 0.132267 -1.842263
C  0.357367 -0.125896 0.756286
C  -0.361064 -1.352582 0.206808
C  -0.27024 1.249002 0.354972
C  0.370959 -0.161877 2.307841
C  -1.663732 -1.231951 -0.202096
C  -2.349746 0.059626 -0.303592
C  -1.676588 1.237455 -0.035346
C  0.376654 -2.669367 0.208128
C  -3.789122 0.056097 -0.769728
C  2.11084 0.072993 -0.954426
C  3.600105 0.230704 -1.147891
H  0.872959 -1.075116 2.66868
H  0.920488 0.722571 2.671758
H  -0.659307 -0.136751 2.701383
H  -2.21471 -2.127729 -0.515984
H  -2.151799 2.213663 -0.181571
H  -0.306002 -3.507232 -0.011862
H  0.876883 -2.864031 1.174947
H  1.171766 -2.669152 -0.561972
H  -4.420248 -0.551746 -0.092766
H  -3.871725 -0.399357 -1.775597
H  -4.209956 1.073536 -0.816257
H  4.160576 -0.425663 -0.463382
H  3.877582 1.274807 -0.913914
H  3.867598 0.021354 -2.194265
