program: Gaussian 09
title: 000247783
version: EM64L-G09RevD.01
frameworkgroup: C1[X(C18H18N2O4)]
method: RPBEPBE
basis: SDD
operation: Freq
keyword: #p
keyword: freq=noraman
keyword: PBEPBE/SDD
title: #p freq=noraman PBEPBE/SDD
converged: YES YES NO NO
title: Mulliken charges:
elementType: O O O O N N C C C C C C C C C C C C C C C C C C H H H H H H H H H H H H H H H H H H
charge: -0.243666 -0.328422 -0.446508 -0.257555 -0.357198 -0.451820 -0.231307 -0.638993 0.499728 0.191439 -0.451961 -0.383326 0.479487 0.291962 -0.227869 -0.234050 -0.344494 -0.443815 -0.241235 -0.783544 -0.356936 -0.304877 0.265776 0.101970 0.290439 0.256470 0.249357 0.330003 0.369900 0.239127 0.232716 0.230168 0.230106 0.307504 0.250383 0.233214 0.241379 0.245316 0.267500 0.269195 0.273246 0.381189
chargesum: 0.00000
title: Mulliken charges with hydrogens summed into heavy atoms:
elementType: O O O O N N C C C C C C C C C C C C C C C C C C
charge: -0.243666 -0.328422 -0.065319 -0.257555 -0.027196 -0.081920 0.059132 -0.133166 0.499728 0.191439 -0.212833 -0.150609 0.479487 0.291962 0.002298 -0.003943 -0.036990 -0.193432 -0.008020 -0.029348 -0.087741 -0.031631 0.265776 0.101970
polarizability: 3.68728952e+02 7.29366633e+00 1.82554415e+02 -8.89501741e+00 2.40062884e+01 1.52621748e+02
1716.lowfreq: -76.4929 -5.1336 -2.0821 -0.0003 0.0005 0.0007 4.5471 15.0362 30.4088
frequency: -76.4687 14.9292 30.2974 32.6086 41.1004 44.0635 67.8767 73.6575 86.3508 91.4423 120.7395 151.0696 166.0523 169.5375 193.2402 228.4658 238.9203 290.7425 326.9530 333.4843 343.9647 378.4399 403.8365 413.6737 419.0869 442.6326 487.2724 510.6377 512.6157 536.7815 555.2204 584.8813 587.0710 590.0300 606.3040 617.2239 627.7397 672.2280 689.4853 707.3390 714.8548 750.5647 764.5362 772.1514 827.1622 830.7166 846.1650 855.2373 859.3251 886.0512 914.5305 927.7383 946.7475 955.8944 978.0260 987.0416 989.0957 990.6729 996.1319 998.9676 1011.0065 1019.6266 1026.1774 1038.2428 1041.4590 1090.4985 1109.9529 1125.1171 1150.4173 1160.4150 1173.7347 1188.9829 1196.7826 1207.5308 1218.8684 1272.2167 1281.4928 1288.4726 1307.5516 1319.0135 1322.0217 1334.0548 1343.8430 1378.0178 1382.0102 1383.4653 1428.6051 1440.4048 1442.1773 1459.9612 1467.2101 1484.0840 1488.6477 1504.5576 1544.3524 1579.1476 1591.8032 1593.7792 1614.3091 1625.3609 1642.3231 1650.4586 2989.1628 2995.1098 3015.1883 3071.3087 3080.8339 3110.9397 3115.8630 3133.4534 3133.4845 3138.2259 3145.8739 3151.9967 3155.8481 3164.5453 3179.3081 3196.9392 3527.7112 3533.8634
redmass: 1.0394 6.0261 4.4136 5.4352 4.4663 5.0638 8.2145 5.5063 6.2861 5.1746 6.0554 5.8340 6.9465 4.6811 4.6630 6.4464 5.1823 6.0574 6.4012 2.3256 5.2216 6.8484 2.8224 3.0034 3.2059 3.8652 6.1802 3.7075 2.8232 1.8945 2.4182 4.3728 1.3090 2.6850 3.9653 6.3489 6.9636 5.3643 3.7119 1.9243 5.3104 1.8060 4.3651 5.1888 3.5418 4.7388 1.3995 1.4409 1.8432 1.5069 2.2422 1.9171 3.1695 1.3650 1.3969 1.3738 2.8197 2.3565 4.7136 1.3471 1.3325 2.7664 2.2534 1.8523 1.7985 1.7279 3.6299 1.3400 1.6713 1.7285 1.0590 1.1284 1.1894 2.0251 2.4280 1.3565 1.9055 2.1988 1.4923 1.5131 2.5344 1.2867 1.4579 5.2264 7.1994 1.2508 4.3227 2.1297 1.2597 1.1160 1.0465 2.2784 1.8073 2.6678 3.1294 4.6828 6.1206 5.8763 6.1432 5.4340 8.3506 2.3614 1.0834 1.0383 1.0612 1.1011 1.0982 1.0884 1.0877 1.0897 1.0906 1.0985 1.0954 1.0856 1.0909 1.1013 1.0949 1.0951 1.0783 1.0641
irintensity: 0.0049 0.0101 0.3099 0.7072 2.5405 0.9272 1.4644 0.5104 6.7437 8.1932 7.6276 4.8470 2.5290 3.0792 6.3408 22.8621 2.4073 1.6821 0.6669 2.0242 0.7820 32.8289 0.2939 1.3279 13.9041 12.1295 6.0987 11.4279 38.7757 93.9904 64.0722 43.7022 71.2031 4.4037 20.7791 0.5709 0.2397 3.5855 72.7563 43.2898 15.6226 61.7468 9.4093 7.6538 0.9939 2.5200 3.9730 2.5606 6.4739 43.7747 12.1012 17.8097 22.5059 100.9017 0.1154 9.0484 3.9003 1.8875 200.8064 0.0802 0.4794 157.9025 7.6504 18.0229 3.4015 14.7384 6.4377 15.8651 185.4678 31.1199 0.4977 1.9524 3.2637 34.6648 0.8992 7.9313 29.8302 49.7144 0.2315 20.0138 193.2121 4.3590 2.9171 177.6386 1.1145 44.0105 30.3412 9.4590 137.9058 25.4380 16.2128 38.6082 115.5707 35.6129 495.7087 399.8873 82.9471 134.3542 11.9879 84.6560 390.1010 70.6148 5.8442 6.7979 6.8281 7.2466 10.3046 9.7394 11.4528 7.0205 2.5569 6.6694 34.4065 543.2734 6.0332 23.6468 2.6487 2.2451 34.6733 51.3152
temp: 298.150 k
press: 1.00000 atm
elementType: 8 8 8 8 7 7 6 6 6 6 6 6 6 6 6 6 6 6 6 6 6 6 6 6 1 1 1 1 1 1 1 1 1 1 1 1 1 1 1 1 1 1
symmnumber: 1
zpe: 860996.7 jmol-1
zpe.correction: 0.327936 hartree
zpe.thermalcorrener: 0.349527 hartree
zpe.thermalcorrenthalpy: 0.350472 hartree
zpe.thermalcorrgfe: 0.274008 hartree
zpe.sumelectzpe: -1105.454193 hartree
zpe.sumelectthermal: -1105.432602 hartree
zpe.sumelectthermalent: -1105.431658 hartree
zpe.sumelectthermalfe: -1105.508121 hartree
dipole: 6.6650 3.4552 -0.5952
dipole: 7.5309
quadrupole: -132.7460 -146.5653 -133.6932
quadrupole: -7.1186 -9.4286 -5.9306
quadrupole: 4.9222 -8.8971 3.9750 -7.1186 -9.4286 -5.9306
hfenergy: -1105.7821294 hartree
pointgroup: C01 [X(C18H18N2O4)]
dipole: 2.6999407 0.8147783 0.9083576 debye
polarizability: 369.2239421|-1.7433621|139.3227001|-3.5210616|5.6944018|195.3584726 unknown
InChI: InChI=1S/C18H18N2O4/c1-12(21)19-16(11-13-5-3-2-4-6-13)17(22)20-15-9-7-14(8-10-15)18(23)24/h2-10,16,19-20,23H,11H2,1H3
charge 0 multiplicity 1
42 atoms
O  -0.152656 -0.634907 -2.069492
O  0.810817 0.850838 2.125916
O  -7.13357 0.50421 1.127854
O  -7.239474 0.004534 -1.137506
N  2.003968 0.916753 0.142401
N  -0.826506 -0.19682 0.150825
C  1.574472 -0.431972 -0.30016
C  2.540791 -0.979607 -1.377414
C  3.99811 -0.96638 -0.937666
C  0.108878 -0.427631 -0.847587
C  4.937227 -0.113277 -1.572214
C  4.449313 -1.801152 0.118477
C  -2.234259 -0.110815 0.034028
C  1.659928 1.44034 1.368773
C  6.290743 -0.087173 -1.160575
C  5.798606 -1.779029 0.532637
C  -2.935213 -0.331691 -1.186184
C  -2.960916 0.210315 1.217577
C  6.725015 -0.918808 -0.104039
C  2.336316 2.7450 1.760529
C  -4.336737 -0.230084 -1.203642
C  -4.359868 0.308721 1.187306
C  -5.064112 0.088953 -0.026959
C  -6.539071 0.181878 -0.109099
H  1.592183 -1.0797 0.599532
H  2.400315 -0.396552 -2.305351
H  2.210558 -2.006272 -1.617647
H  2.705094 1.395722 -0.428169
H  -0.41136 0.025688 1.083327
H  4.612419 0.517802 -2.410013
H  3.742806 -2.479231 0.614061
H  7.002888 0.573371 -1.667898
H  6.130185 -2.433994 1.346151
H  -2.373922 -0.574043 -2.089868
H  -2.416969 0.382989 2.153622
H  7.772959 -0.904171 0.215107
H  2.10894 3.544575 1.03196
H  3.434029 2.627114 1.807491
H  1.967577 3.052563 2.749296
H  -4.89281 -0.396729 -2.132152
H  -4.920053 0.55508 2.093155
H  -8.11834 0.548495 0.997408
