program: Gaussian 09
title: 000247772
version: EM64L-G09RevD.01
frameworkgroup: C1[X(C11H21NS)]
method: RPBEPBE
basis: SDD
operation: Freq
keyword: #p
keyword: freq=noraman
keyword: PBEPBE/SDD
title: #p freq=noraman PBEPBE/SDD
converged: YES YES NO NO
title: Mulliken charges:
elementType: S N C C C C C C C C C C C H H H H H H H H H H H H H H H H H H H H H
charge: 0.159652 -0.033293 -0.376159 -0.371372 -0.370230 -0.352532 -0.335969 -0.356375 -0.683209 -0.696160 -0.664011 -0.378830 -0.102646 0.193544 0.191621 0.191614 0.188810 0.200269 0.190687 0.187303 0.188623 0.213346 0.212309 0.194553 0.195844 0.246813 0.286467 0.209493 0.210024 0.215385 0.271445 0.260341 0.267980 0.244664
chargesum: 0.00000
title: Mulliken charges with hydrogens summed into heavy atoms:
elementType: S N C C C C C C C C C C C
charge: 0.159652 -0.033293 0.009005 0.009052 0.020727 0.023394 0.089686 0.034022 -0.149929 -0.061259 -0.132225 0.133814 -0.102646
polarizability: 1.88063451e+02 -7.27331804e+00 1.27590380e+02 3.16641150e+00 3.28897039e+00 1.06739504e+02
1716.lowfreq: -1.5499 -0.0015 -0.0007 0.0021 6.6854 9.0814 23.1130 36.2375 41.5149
frequency: 22.1365 35.7151 40.2631 49.4709 61.4221 71.3775 92.4872 108.9602 117.3173 142.2846 150.7977 162.9869 189.2928 224.3890 234.0836 292.0406 315.1076 355.0690 368.9703 439.2468 474.2573 542.9436 622.2675 690.2963 723.9409 731.4096 751.0008 788.4649 793.9855 852.2726 888.8454 902.6391 927.7516 959.6328 989.3736 1001.3990 1018.3460 1027.2390 1041.1921 1066.4728 1070.0368 1076.1946 1080.2961 1119.1818 1165.0389 1185.7551 1207.9896 1214.7644 1220.1762 1247.0596 1257.8848 1276.9057 1282.5493 1285.5091 1290.8128 1295.3378 1299.4206 1320.8951 1325.7786 1345.1419 1355.3355 1355.9161 1390.2707 1434.4612 1437.9281 1456.2246 1462.1948 1463.0378 1466.9919 1471.5781 1478.0404 1478.4594 1485.0193 1488.9199 2199.8241 2951.0422 2952.6521 2956.8829 2962.8905 2968.2726 2971.7697 2978.5316 2985.6158 2985.6819 2994.4814 3006.3121 3011.9204 3021.0052 3027.9562 3034.8271 3046.6578 3054.8626 3068.4767 3070.4507 3101.1450 3103.3723
redmass: 4.1472 3.5221 2.1027 4.0534 2.2603 3.5133 2.5872 2.1636 3.5544 2.1730 1.9804 5.0860 4.0848 2.5440 1.1249 4.1927 3.3444 3.8513 3.1318 3.0973 3.1079 3.7408 5.2716 5.2745 1.0623 1.0794 1.1074 1.2075 2.2358 1.2195 1.8866 2.3158 1.2235 1.9676 4.2640 1.1730 3.7625 3.3023 3.3126 1.5787 1.6269 2.3906 2.1876 2.5552 1.1239 1.7859 1.1688 1.2291 1.4513 1.2478 1.2888 1.2241 1.0274 1.1749 1.2231 1.0799 1.1173 1.3331 1.3610 1.4602 1.5989 1.6346 1.2182 1.0880 1.0808 1.0879 1.0736 1.0733 1.0669 1.0789 1.0426 1.0785 1.0877 1.0942 12.4273 1.0589 1.0588 1.0593 1.0593 1.0587 1.0366 1.0590 1.0617 1.0967 1.0990 1.1011 1.0612 1.1025 1.0601 1.1039 1.1040 1.0959 1.1007 1.0993 1.1064 1.1067
irintensity: 1.3246 0.4806 1.9614 4.3403 2.1963 2.3036 0.5022 0.2293 3.4123 0.3216 0.0474 1.2944 0.7418 0.6668 0.0045 1.8253 1.3366 2.7110 0.4196 0.1215 0.6015 4.4208 2.1530 8.4945 13.8515 0.8978 6.3367 0.1394 1.9684 1.8183 5.6729 8.6219 0.1127 4.5241 0.6652 0.7138 0.4387 2.0860 1.5454 1.3202 3.0813 0.2646 0.4659 13.7862 0.5930 0.3641 1.6080 6.8766 0.6323 8.6131 0.6127 17.1918 0.5500 1.1845 7.0544 0.1800 0.0102 3.6797 1.2890 4.2856 0.0090 0.4435 11.3492 15.7968 17.1631 4.2001 0.0256 0.5963 0.8740 1.1345 12.2699 1.3908 2.0551 29.1731 7.5195 0.1372 0.6880 2.5389 15.3940 132.8290 36.2076 51.0981 16.0286 0.4194 0.0676 0.7385 26.0665 1.3803 21.8760 29.4714 134.2317 7.3168 96.3901 55.4411 23.3892 9.0260
temp: 298.150 k
press: 1.00000 atm
elementType: 16 7 6 6 6 6 6 6 6 6 6 6 6 1 1 1 1 1 1 1 1 1 1 1 1 1 1 1 1 1 1 1 1 1
symmnumber: 1
zpe: 780640.4 jmol-1
zpe.correction: 0.297330 hartree
zpe.thermalcorrener: 0.314753 hartree
zpe.thermalcorrenthalpy: 0.315697 hartree
zpe.thermalcorrgfe: 0.248692 hartree
zpe.sumelectzpe: -883.501047 hartree
zpe.sumelectthermal: -883.483624 hartree
zpe.sumelectthermalent: -883.482680 hartree
zpe.sumelectthermalfe: -883.549685 hartree
dipole: 1.1819 -1.9206 1.3681
dipole: 2.6377
quadrupole: -70.5670 -104.0032 -88.7181
quadrupole: -7.8274 4.5516 -0.3531
quadrupole: 17.1957 -16.2404 -0.9553 -7.8274 4.5516 -0.3531
hfenergy: -883.7983767 hartree
pointgroup: C01 [X(C11H21N1S1)]
dipole: -0.3968069 0.8113906 -0.5110027 debye
polarizability: 186.5439392|-12.0688861|108.716094|5.6025122|-5.156483|127.1333021 unknown
InChI: InChI=1S/C11H21NS/c1-2-3-4-5-6-7-10-13-11-8-9-12/h2-8,10-11H2,1H3
charge 0 multiplicity 1
34 atoms
S  -2.911652 0.655114 -1.455832
N  -3.847235 -0.715874 2.364095
C  2.351411 0.022073 -0.537367
C  3.547396 0.039604 0.441233
C  1.009477 0.393305 0.134045
C  4.89187 -0.318828 -0.231302
C  -0.181537 0.361256 -0.854401
C  6.088136 -0.307387 0.747744
C  -1.505978 0.737198 -0.169756
C  7.429013 -0.656483 0.066265
C  -4.348839 1.394364 -0.479138
C  -5.179787 0.355066 0.317597
C  -4.445142 -0.24351 1.445762
H  2.266126 -0.986307 -0.993399
H  2.550564 0.725784 -1.372487
H  3.352244 -0.671135 1.271419
H  3.627364 1.044999 0.905573
H  0.812218 -0.30616 0.972311
H  1.09201 1.405262 0.58249
H  5.090502 0.394631 -1.058594
H  4.812846 -1.322423 -0.699577
H  -0.265681 -0.653813 -1.291609
H  0.012847 1.057059 -1.694626
H  6.161786 0.693441 1.220574
H  5.892227 -1.025303 1.570362
H  -1.473642 1.771667 0.217597
H  -1.742611 0.044738 0.653577
H  7.665284 0.066798 -0.737097
H  7.390804 -1.663443 -0.390851
H  8.266367 -0.644909 0.788214
H  -4.999583 1.868143 -1.233017
H  -3.951828 2.182687 0.182408
H  -5.505791 -0.454207 -0.361411
H  -6.093982 0.838691 0.718097
