program: Gaussian 09
title: 000247774
version: EM64L-G09RevD.01
frameworkgroup: C1[X(C18H13Br)]
method: RPBEPBE
basis: SDD
operation: Freq
keyword: #p
keyword: freq=noraman
keyword: PBEPBE/SDD
title: #p freq=noraman PBEPBE/SDD
converged: YES YES NO NO
title: Mulliken charges:
elementType: Br C C C C C C C C C C C C C C C C C C H H H H H H H H H H H H H
charge: 0.014010 0.382232 0.292520 -0.505187 0.243813 0.259902 -0.409887 -0.387933 -0.171061 -0.355618 -0.355586 -0.383997 -0.383991 -0.221149 -0.221130 -0.218902 -0.218906 -0.237662 -0.238699 0.271712 0.254311 0.251012 0.240511 0.240517 0.244471 0.244469 0.227463 0.227464 0.228088 0.228088 0.229090 0.230034
chargesum: 0.00000
title: Mulliken charges with hydrogens summed into heavy atoms:
elementType: Br C C C C C C C C C C C C C C C C C C
charge: 0.014010 0.382232 0.292520 -0.233475 0.243813 0.259902 -0.409887 -0.133622 0.079951 -0.115107 -0.115070 -0.139526 -0.139522 0.006314 0.006334 0.009185 0.009181 -0.008571 -0.008665
polarizability: 2.81605120e+02 -3.83010784e+00 1.73394514e+02 1.00609086e-02 -6.74359230e-03 1.60152195e+02
1716.lowfreq: -53.0413 -33.6804 -5.7849 -3.9796 -0.0006 -0.0005 -0.0004 4.7843 44.2192
frequency: -53.0382 -33.6517 44.1985 44.5069 71.6909 73.4476 146.2441 171.2054 200.5349 227.1396 301.1666 302.0652 359.5013 359.7815 396.7775 398.7533 406.3567 473.3150 521.2210 564.6629 604.2620 613.7097 617.4013 634.2644 645.6688 695.8139 702.9532 706.6727 737.4795 764.2466 768.0283 811.1203 827.3060 848.9850 851.8074 911.0007 916.7598 919.5396 957.3563 971.6344 972.7579 987.0228 988.1720 991.8935 994.1372 995.4091 1009.1260 1023.9669 1040.4995 1070.3911 1077.5759 1078.3115 1139.0602 1172.3825 1172.4656 1186.3562 1187.1736 1238.6152 1251.5997 1305.0685 1308.5958 1310.2240 1345.8163 1368.6904 1370.4518 1374.0619 1428.2551 1429.1855 1445.6590 1484.5698 1486.6808 1565.5286 1583.6458 1585.2040 1592.9005 1614.1781 1614.6866 3123.3305 3123.6676 3128.8560 3130.2055 3140.8504 3141.2219 3141.9596 3143.9193 3150.0581 3151.1664 3165.0712 3165.2630 3167.8944
redmass: 3.8862 3.7533 6.5981 5.6868 7.1906 4.1294 5.4454 6.1003 12.2901 4.7239 4.2825 5.4019 5.1696 4.3894 2.8295 2.8184 6.7651 3.3148 3.4032 3.3477 6.0160 6.3890 6.9240 7.0802 5.2943 5.3290 1.6830 1.8008 3.7715 1.9376 2.1133 5.0167 1.3816 1.2468 1.2436 1.4590 1.4046 1.4171 1.3463 1.3883 1.3838 6.3482 6.0880 6.4981 1.3595 1.3100 5.7059 2.5012 1.9721 1.8997 1.6001 1.5973 1.4819 1.0528 1.0534 1.1144 1.1146 2.0311 1.4711 2.4546 1.3726 1.3626 8.0234 6.8008 6.9968 3.5822 2.2034 2.2133 2.4591 2.6728 2.6960 7.2919 6.0003 6.0510 6.5196 6.2910 6.3876 1.0845 1.0844 1.0877 1.0877 1.0924 1.0925 1.0900 1.0913 1.0969 1.0970 1.1018 1.1018 1.0968
irintensity: 0.0327 0.0182 0.0120 0.3141 0.1881 0.5896 0.0001 0.3866 0.6148 0.3577 0.1363 0.2542 1.4807 0.6553 0.0014 0.0415 6.7108 10.1856 20.0494 13.6408 1.0627 0.1206 9.2889 2.3964 3.7867 12.3836 39.1897 57.8980 1.3761 58.6364 20.5532 6.7402 29.7882 0.0021 0.2740 10.2384 0.9923 0.6581 0.0562 0.0237 0.0022 4.9970 3.3296 52.6389 1.9420 0.0803 11.6371 31.2939 1.9969 8.7071 5.7114 10.4907 2.4002 0.0060 0.0188 2.4291 0.4209 0.6077 4.2987 0.4741 0.7761 0.5556 2.5867 0.0772 0.0013 20.9672 9.0386 6.3457 96.7382 1.3728 6.2869 0.9234 1.5879 1.2698 5.2495 2.6930 8.3069 2.4962 1.3391 0.1619 0.2545 23.5471 22.1209 0.7452 2.0671 35.2764 38.5270 32.0270 16.0577 5.7874
temp: 298.150 k
press: 1.00000 atm
elementType: 35 6 6 6 6 6 6 6 6 6 6 6 6 6 6 6 6 6 6 1 1 1 1 1 1 1 1 1 1 1 1 1
symmnumber: 1
zpe: 647373.3 jmol-1
zpe.correction: 0.246571 hartree
zpe.thermalcorrener: 0.260627 hartree
zpe.thermalcorrenthalpy: 0.261571 hartree
zpe.thermalcorrgfe: 0.203726 hartree
zpe.sumelectzpe: -705.892635 hartree
zpe.sumelectthermal: -705.878580 hartree
zpe.sumelectthermalent: -705.877636 hartree
zpe.sumelectthermalfe: -705.935481 hartree
dipole: 1.7966 0.9948 0.0002
dipole: 2.0537
quadrupole: -109.7585 -116.1969 -111.1002
quadrupole: -5.9014 -0.0030 -0.0068
quadrupole: 2.5933 -3.8450 1.2517 -5.9014 -0.0030 -0.0068
hfenergy: -706.1392068 hartree
pointgroup: C01 [X(C18H13Br1)]
dipole: -0.6285172 -0.507731 0.00007 debye
polarizability: 279.6737196|14.8302871|175.3259138|-0.0110755|0.0049021|160.1521955 unknown
InChI: InChI=1S/C18H13Br/c19-18-12-11-16(14-7-3-1-4-8-14)13-17(18)15-9-5-2-6-10-15/h1-13H
charge 0 multiplicity 1
32 atoms
Br 2.881787 2.93898 -0.000118
C  1.140735 0.562273 -0.000012
C  -1.3421 0.675952 0.000049
C  -0.134611 -0.06458 0.00002
C  2.378679 -0.286536 -0.000042
C  -2.670794 -0.024259 0.000071
C  1.166606 1.979832 -0.00002
C  -1.26891 2.091893 0.000049
C  -0.017895 2.745791 0.000011
C  2.961281 -0.70746 -1.222622
C  2.962141 -0.70632 1.222521
C  -3.310134 -0.359193 1.222155
C  -3.309743 -0.359991 -1.221999
C  4.110058 -1.530201 -1.222537
C  4.110916 -1.529061 1.222393
C  -4.5625 -1.014817 1.222345
C  -4.562109 -1.015614 -1.222165
C  4.688278 -1.943432 -0.000083
C  -5.192522 -1.344488 0.000096
H  -0.173446 -1.15951 0.00003
H  -2.189702 2.684973 0.000066
H  0.035542 3.838329 -0.000006
H  2.515969 -0.384753 -2.170572
H  2.517495 -0.382734 2.170483
H  -2.823158 -0.104747 2.170498
H  -2.822468 -0.106155 -2.170352
H  4.552233 -1.846801 -2.173865
H  4.553757 -1.844781 2.173704
H  -5.044243 -1.267422 2.173664
H  -5.043549 -1.268832 -2.173474
H  5.57947 -2.581091 -0.000099
H  -6.163365 -1.852649 0.000108
