program: Gaussian 09
title: 000247753
version: EM64L-G09RevD.01
frameworkgroup: C1[X(C8H9NO3)]
method: RPBEPBE
basis: SDD
operation: Freq
keyword: #pfreq=noraman
keyword: PBEPBE/SDD
title: #p freq=noraman PBEPBE/SDD
converged: NO YES NO NO
title: Mulliken charges:
elementType: O O O N C C C C C C C C H H H H H H H H H
charge: -0.418414 -0.433156 -0.349399 -0.411143 0.520870 0.101596 -0.554274 0.194154 -0.378110 -0.324109 -0.633525 0.160197 0.244542 0.239728 0.264389 0.307198 0.236542 0.226130 0.236495 0.385132 0.385157
chargesum: 0.00000
title: Mulliken charges with hydrogens summed into heavy atoms:
elementType: O O O N C C C C C C C C
charge: -0.033282 -0.047999 -0.349399 -0.103945 0.520870 0.101596 -0.309731 0.194154 -0.138383 -0.059720 0.065642 0.160197
polarizability: 1.92251735e+02 3.45005837e-01 1.07795910e+02 -6.14509892e-03 7.77638416e-03 4.77093798e+01
1716.lowfreq: -9.9226 -5.4889 -0.0011 -0.0003 0.0003 7.6392 74.7973 104.5495 130.6715
frequency: 74.7917 104.5469 130.6554 159.3808 166.7509 238.1275 253.9145 275.5881 333.2489 372.8603 433.7646 449.4830 459.8360 534.2481 556.9663 559.8615 608.6828 630.6675 678.4364 708.2737 733.5909 742.5414 808.5147 848.1867 860.5127 929.4001 966.8190 1013.3357 1064.2506 1118.6932 1120.7759 1161.0509 1189.7176 1212.6170 1234.6945 1310.5088 1350.6177 1361.1329 1410.2288 1447.2683 1464.9516 1468.8216 1483.3348 1498.9440 1519.5036 1574.3011 1597.4435 1666.5801 2957.1978 2994.5794 3025.3295 3098.8121 3151.0821 3155.3775 3177.3097 3532.9530 3581.5468
redmass: 3.9062 4.1614 4.7117 1.1815 4.1754 5.3887 4.3658 4.0229 7.3298 5.3414 1.5336 8.5043 1.7522 5.0991 1.1856 6.1906 4.1277 5.4726 3.0229 4.5197 6.0401 3.1598 1.5993 1.6504 1.1770 3.8019 1.3305 5.2770 2.1429 1.5863 1.2789 1.6387 1.5667 2.1891 1.6047 1.8357 2.1634 3.6577 4.1162 1.2269 2.0394 1.0412 2.3355 1.2671 2.7945 3.6668 4.6467 4.9479 1.0371 1.0695 1.1014 1.0968 1.0916 1.0873 1.0968 1.0640 1.0774
irintensity: 2.9397 0.0608 0.3503 0.7024 0.7939 0.0955 0.4329 0.0795 4.9279 17.7379 121.0011 1.1297 15.4210 22.6205 104.4172 20.9012 24.3023 9.3902 39.5980 5.2665 2.8030 0.2145 23.8549 182.7509 39.6654 20.2566 0.4063 234.5655 79.9125 132.4741 1.7327 72.6257 49.5112 92.0458 58.2464 130.1129 35.7728 145.0801 127.1845 18.9116 214.3808 13.7838 104.4243 52.3131 173.4426 152.6583 16.2753 683.7357 95.8526 268.3701 44.1989 22.7029 6.8236 2.1476 9.7877 71.8963 58.8663
temp: 298.150 k
press: 1.00000 atm
elementType: 8 8 8 7 6 6 6 6 6 6 6 6 1 1 1 1 1 1 1 1 1
symmnumber: 1
zpe: 422058.1 jmol-1
zpe.correction: 0.160753 hartree
zpe.thermalcorrener: 0.171810 hartree
zpe.thermalcorrenthalpy: 0.172755 hartree
zpe.thermalcorrgfe: 0.124141 hartree
zpe.sumelectzpe: -589.816785 hartree
zpe.sumelectthermal: -589.805728 hartree
zpe.sumelectthermalent: -589.804784 hartree
zpe.sumelectthermalfe: -589.853397 hartree
dipole: 4.5099 -2.0355 -0.0025
dipole: 4.9480
quadrupole: -49.8971 -70.1085 -73.6420
quadrupole: 8.2388 0.0161 -0.0091
quadrupole: 14.6521 -5.5593 -9.0928 8.2388 0.0161 -0.0091
hfenergy: -589.9775383 hartree
pointgroup: C01 [X(C8H9N1O3)]
dipole: 1.7647173 -0.8086568 0.1465136 debye
dipolederiv: -0.8180868 0.4101907 -0.0516222 0.4166628 -0.9085032 0.0601182 -0.0523787 0.0593141 -0.4113918 -0.6896303 -0.4370294 0.0215194 -0.8894163 -1.1096597 0.0119578 0.0566007 0.033032 -0.4215589 -1.3742501 0.2088665 -0.0638866 0.4444269 -0.838405 0.0575828 -0.0822307 0.0469942 -0.3794316 -1.8206866 0.1128074 -0.0727168 -0.2704542 -0.2526233 -0.0306907 -0.0420585 -0.0125012 -0.4811914 1.8590289 -0.0138621 0.0815256 0.4553252 0.3781764 0.0054466 0.0447059 -0.0167395 0.1728185 -1.5358055 -0.2051861 -0.0523044 0.0275704 -0.4325785 0.028001 -0.0702732 0.0169459 -0.0985478 -0.9264476 0.2877514 -0.0537716 0.3599335 -0.0847003 0.0024064 -0.0596472 -0.0008203 -0.2759535 1.1897298 -0.4436888 0.0858014 -0.044556 0.8310068 -0.0582777 0.0547846 -0.0773795 0.131231 -0.7303113 -0.1189606 -0.0123516 -0.609543 -0.1707735 -0.0370233 0.0262757 -0.013661 -0.2718475 0.8583091 0.0025148 0.0433343 -0.3237615 0.0730049 -0.0259197 0.0688243 -0.0107429 -0.0574419 0.5283086 -0.1490118 0.0236565 -0.4544367 0.3457124 -0.0269626 0.0473735 -0.0123683 0.2839043 2.5416956 0.2495891 0.0893015 0.4034484 1.3854361 -0.0705531 0.07756 -0.0777077 0.2515352 0.0295827 -0.0695524 -0.0018933 -0.0664048 -0.0410232 0.0144757 -0.0022893 0.0144047 0.1829967 -0.0065322 0.092401 -0.0158198 0.090446 -0.0160762 0.0192403 -0.0156796 0.0192997 0.1726729 0.1003132 -0.0483425 0.0013961 -0.0311862 -0.0139374 0.0115312 0.0000257 0.0108241 0.1505998 0.1437957 0.0475882 -0.0126004 0.1328034 0.0934308 0.024806 -0.0191824 0.0206648 0.3256954 0.051613 -0.0148945 0.0554393 0.15971 -0.0180164 0.1090669 -0.0600967 0.1132582 -0.1018116 -0.1435602 -0.0474566 -0.0092334 -0.132379 0.0422677 0.0005526 -0.00257 0.0045923 0.1281374 0.0512004 -0.0111391 -0.0404697 0.1780559 -0.0535406 -0.1005767 0.0461923 -0.1220799 -0.0656392 0.4674977 0.0696647 -0.0010021 -0.0301779 0.4604739 -0.0091516 0.0066931 -0.0043185 0.3688591 0.2242361 0.0777502 -0.0143024 0.1839332 0.3303282 0.0139699 -0.0226295 0.0089891 0.3963648 unknown
polarizability: 191.9271009|0.078616|107.4274587|6.845895|-4.6849013|48.4024654 unknown
InChI: InChI=1S/C8H9NO3/c1-9-5-2-3-6(8(11)12)7(10)4-5/h2-4,9-11H,1H3
charge 0 multiplicity 1
21 atoms
O  -1.280666 2.189664 -0.24035
O  -2.909372 -1.734992 -0.008657
O  -3.286876 0.543039 -0.205155
N  3.181848 0.404685 0.112508
C  1.814171 0.180392 0.064893
C  -1.007585 -0.253588 -0.034941
C  0.925647 1.285055 -0.063696
C  -0.463038 1.083289 -0.114083
C  1.277428 -1.151736 0.143513
C  -0.10388 -1.346558 0.093441
C  4.188838 -0.647801 0.244132
C  -2.445946 -0.420881 -0.089429
H  1.302386 2.311475 -0.126097
H  1.945598 -2.011159 0.242391
H  -0.520718 -2.356535 0.153366
H  3.501257 1.37032 0.051788
H  4.066039 -1.220327 1.184685
H  5.190525 -0.188323 0.25559
H  4.151524 -1.362219 -0.60189
H  -2.249988 1.864833 -0.263114
H  -3.90249 -1.717531 -0.056998
