program: Gaussian 09
title: 000247752
version: EM64L-G09RevD.01
frameworkgroup: C1[X(C8H4Cl2N2O)]
method: RPBEPBE
basis: SDD
operation: Freq
keyword: #p
keyword: freq=noraman
keyword: PBEPBE/SDD
title: #p freq=noraman PBEPBE/SDD
converged: NO YES NO YES
title: Mulliken charges:
elementType: Cl Cl O N N C C C C C C C C H H H H
charge: -0.034418 -0.022497 -0.212919 -0.383912 0.013561 0.536599 0.110276 -0.275744 -0.318236 0.010231 -0.215022 -0.124294 -0.251806 0.305956 0.328193 0.286086 0.247946
chargesum: 0.00000
title: Mulliken charges with hydrogens summed into heavy atoms:
elementType: Cl Cl O N N C C C C C C C C
charge: -0.034418 -0.022497 -0.212919 -0.055719 0.013561 0.536599 0.110276 -0.275744 -0.012279 0.010231 0.071064 -0.124294 -0.003860
polarizability: 1.68783004e+02 -3.44681647e+00 1.55661257e+02 -7.54479008e-03 8.96018334e-03 4.46547230e+01
1716.lowfreq: -3.0818 -0.0035 -0.0026 -0.0025 5.6366 7.5498 64.5976 117.0383 152.9967
frequency: 64.5878 117.0380 152.9943 170.0744 181.3771 197.3815 314.2182 326.6121 336.9805 389.7759 465.4465 493.6756 495.5837 539.2946 565.7901 574.6717 665.7237 668.1334 696.7520 786.0678 787.5584 812.9740 871.1072 897.8104 919.0154 934.7231 1002.5576 1067.6755 1116.8090 1180.3896 1202.4127 1274.8109 1350.7289 1382.2197 1397.7256 1429.9849 1464.4295 1549.9998 1573.5630 1591.6311 1619.0965 3132.1544 3174.1605 3181.6097 3513.6725
redmass: 9.5880 12.1901 6.8742 20.3876 13.7654 5.0375 5.1748 15.8526 13.3906 8.0753 5.1288 10.0665 4.3107 7.3186 3.7229 8.0429 1.5420 8.7361 2.8628 7.3595 9.2216 7.9647 1.3984 6.3047 1.4234 1.4276 7.2827 2.0366 2.6807 3.4631 1.6917 2.1811 2.7057 1.5544 7.0641 2.5544 5.6843 4.6521 8.5612 8.2326 7.9914 1.0930 1.0929 1.0936 1.0785
irintensity: 3.9027 1.6120 1.4440 0.6545 5.5822 0.2840 7.6009 1.1829 11.4202 3.3754 0.4595 1.5158 14.8481 3.7141 10.8392 3.5037 61.9112 46.6727 33.9575 15.0063 15.4710 51.4632 24.8770 7.8996 13.6928 5.8133 14.2118 1.7184 3.0561 94.3616 31.8098 0.1003 37.3502 49.2049 1.9947 20.2082 312.9085 307.8085 52.0334 109.9902 34.1040 18.0912 7.8232 1.1428 74.1852
temp: 298.150 k
press: 1.00000 atm
elementType: 17 17 8 7 7 6 6 6 6 6 6 6 6 1 1 1 1
symmnumber: 1
zpe: 278915.3 jmol-1
zpe.correction: 0.106233 hartree
zpe.thermalcorrener: 0.116725 hartree
zpe.thermalcorrenthalpy: 0.117669 hartree
zpe.thermalcorrgfe: 0.068991 hartree
zpe.sumelectzpe: -1411.205537 hartree
zpe.sumelectthermal: -1411.195045 hartree
zpe.sumelectthermalent: -1411.194101 hartree
zpe.sumelectthermalfe: -1411.242779 hartree
dipole: 0.1293 6.3415 0.0016
dipole: 6.3428
quadrupole: -87.3656 -99.8571 -88.9409
quadrupole: -15.7014 -0.0030 -0.0043
quadrupole: 4.6890 -7.8026 3.1136 -15.7014 -0.0030 -0.0043
hfenergy: -1411.3117697 hartree
pointgroup: C01 [X(C8H4Cl2N2O1)]
dipole: 0.7518889 2.3794875 0.0006228 debye
dipolederiv: -0.1545203 -0.0524534 0.0000043 -0.1257946 -0.7645729 -0.0000269 -0.0000052 0.0000102 -0.0379683 -0.6727315 0.3320594 0.0000584 0.3932951 -0.3309668 -0.0000406 0.0000643 -0.0000587 -0.0438365 -0.5204791 -0.1167777 0.000039 -0.3546259 -1.0936274 0.0001412 -0.0001271 -0.0004494 -0.3471578 -1.1747456 -0.0965104 -0.0000066 -0.0163947 -0.6002626 -0.0000362 -0.0001625 -0.0001484 -0.1970886 -0.4480374 0.3144439 0.0001141 -0.2119998 -1.0463584 -0.0000271 -0.0001097 -0.0000287 -0.2753784 0.5387584 -0.3567978 -0.000073 -0.4070686 -0.1006708 -0.0000447 0.0001031 0.0000647 0.0740752 -0.4150525 -0.3642119 -0.0000859 -0.0985769 -0.0695499 -0.0000068 0.0001121 0.0000491 0.0227326 0.0542884 0.2944658 0.0000047 0.2042512 1.1490434 0.0000445 -0.0000097 -0.0000095 -0.0743593 -0.2664111 0.307993 0.0000161 0.0001594 -0.0853354 -0.0000241 0.0000482 -0.0000155 -0.0627377 0.9381672 0.0358708 -0.0000344 0.3870835 1.4272408 -0.0000421 -0.0000564 0.0002738 0.2345615 -0.1907852 0.03896 0.0000078 0.221588 -0.2078474 -0.0000112 0.0000163 -0.0000105 -0.0358237 0.9249078 -0.6532973 -0.0001243 -0.6602025 0.3798888 0.00007 -0.0001136 0.0001075 -0.0845434 0.9463616 0.3503438 0.0001105 0.5298669 0.9620483 0.0000024 0.0002145 0.0001743 0.0326992 0.1371275 -0.0370953 0.0000033 0.0362827 0.07356 0.000003 0.000004 -0.0000097 0.1643159 0.2176814 -0.0399424 -0.0000158 0.0181138 0.2442324 0.0000024 -0.0000256 -0.0000151 0.332403 0.0518327 -0.0353924 0.0000096 -0.0301356 0.1012097 0. 0.0000199 -0.0000001 0.1684976 0.0336377 0.0783419 -0.0000279 0.1141581 -0.0380317 -0.000004 0.0000274 0.0000661 0.1296087 unknown
polarizability: 165.8771114|-6.4472261|158.5671496|-0.0047141|0.0107232|44.654723 unknown
InChI: InChI=1S/C8H4Cl2N2O/c9-4-1-5-7(6(10)2-4)11-3-12-8(5)13/h1-3,11H
charge 0 multiplicity 1
17 atoms
Cl 1.305691 3.192497 0.000166
Cl 3.533701 -1.908511 -0.000262
O  -1.921432 -2.42779 -0.000528
N  -1.348134 1.626475 0.000307
N  -2.841946 -0.263879 0.000081
C  -0.196568 0.832533 0.000248
C  -0.357559 -0.585351 0.000209
C  1.113265 1.377387 0.000143
C  0.782352 -1.425967 0.000018
C  -1.737777 -1.180275 0.000447
C  2.24616 0.556094 -0.000014
C  2.058264 -0.848546 -0.000077
C  -2.603786 1.032887 0.000149
H  0.625092 -2.508497 -0.00002
H  -1.248657 2.645579 0.000357
H  3.24977 0.989002 -0.000097
H  -3.449633 1.731161 -0.000025
