program: Gaussian 09
title: 000247757
version: EM64L-G09RevD.01
frameworkgroup: C1[X(C11H15NO5)]
method: RPBEPBE
basis: SDD
operation: Freq
keyword: #p
keyword: freq=noraman
keyword: PBEPBE/SDD
title: #p freq=noraman PBEPBE/SDD
converged: YES YES NO NO
title: Mulliken charges:
elementType: O O O O O N C C C C C C C C C C C H H H H H H H H H H H H H H H
charge: -0.438328 -0.435240 -0.417612 -0.433826 -0.350199 -0.146579 -0.442827 -0.441285 0.513500 -0.324680 -0.322520 -0.505379 -0.376607 0.149515 0.109407 -0.350201 0.155702 0.230106 0.262514 0.223331 0.265241 0.250763 0.199916 0.246157 0.197187 0.250761 0.224769 0.263607 0.335870 0.335456 0.386577 0.384903
chargesum: 0.00000
title: Mulliken charges with hydrogens summed into heavy atoms:
elementType: O O O O O N C C C C C C C C C C C
charge: -0.102458 -0.099784 -0.031035 -0.048923 -0.350199 -0.146579 0.049792 0.047288 0.513500 0.125999 0.120825 -0.254618 -0.151838 0.149515 0.109407 -0.086594 0.155702
polarizability: 2.62363349e+02 4.20064373e-01 1.39553521e+02 7.73755645e-01 1.86480148e+01 8.73445312e+01
1716.lowfreq: -5.0796 -4.1566 -0.0005 0.0002 0.0004 6.2105 28.0929 34.9301 56.3098
frequency: 27.5858 34.8664 56.2498 73.2866 100.1197 114.4644 123.1237 130.8439 185.5736 207.8470 214.6166 247.0197 261.3149 290.3060 298.3045 327.4914 349.8883 393.2602 416.4387 451.0711 455.0323 497.8340 528.7854 554.8840 555.6760 557.1886 589.4138 628.9323 668.0890 678.2696 726.7881 741.6036 799.0433 800.4436 840.7297 844.3228 863.5794 873.4543 905.3918 945.5084 963.7640 993.6349 998.7851 1016.0540 1035.2706 1038.2367 1044.1570 1127.7824 1154.2745 1169.2895 1185.1444 1197.7265 1215.9167 1243.1219 1265.7854 1281.2016 1315.0032 1325.0296 1329.2886 1357.6312 1364.0639 1369.4247 1372.3112 1382.4133 1410.6064 1413.2348 1457.5176 1459.1142 1463.7506 1480.0132 1493.6915 1513.5320 1551.7536 1590.2801 1661.4382 2957.2466 2964.1457 2988.9390 3002.0710 3007.4062 3055.0908 3059.6076 3093.8882 3096.4381 3155.8244 3178.7095 3185.5970 3535.4482 3558.9839 3559.4726
redmass: 6.0357 6.2612 6.4901 5.7516 4.4964 3.8293 5.9041 2.8062 4.9601 4.9999 4.6437 5.2243 1.1230 3.0956 1.4701 5.4837 3.4672 2.5265 5.9729 2.9186 2.8097 2.7425 3.0037 2.3817 1.3682 3.4643 4.1982 5.3952 4.3576 3.2587 5.5577 3.1142 3.0283 1.6674 1.9281 2.5239 1.0978 3.4199 2.0499 2.5679 1.3205 1.8325 2.3214 3.9388 1.6258 2.5079 3.4737 1.7403 1.3539 1.4056 2.0816 1.5599 1.6016 1.5731 1.3407 1.6272 1.9853 1.2995 1.2316 1.3034 1.2647 1.3366 1.2637 2.4167 5.1122 2.0551 1.0842 1.0897 2.4445 1.2242 1.2108 3.3910 4.2583 5.0220 4.7930 1.0685 1.0682 1.0696 1.0615 1.0617 1.1016 1.1022 1.0960 1.0966 1.0873 1.0952 1.0908 1.0640 1.0664 1.0664
irintensity: 1.7787 0.4095 0.8141 5.5667 1.8627 8.7693 2.3146 26.8737 4.3810 2.5769 2.4509 2.6878 254.1365 45.9274 64.5452 6.1548 11.1533 24.8263 8.1032 24.6330 6.7926 3.9785 23.5204 58.0704 70.5061 45.1631 0.7788 8.2484 13.3064 35.3999 8.8215 1.4341 2.5336 30.0384 30.6485 95.1637 90.2118 54.2955 15.2674 69.2198 2.0568 74.3333 100.1736 92.1800 172.0862 23.6490 55.5229 272.2403 17.2561 12.4276 19.2301 43.3223 120.1458 107.2228 31.1478 71.2080 72.4753 19.4220 17.1929 5.7900 27.0348 9.6222 134.1035 40.3601 150.8625 64.9336 3.2274 12.7225 233.7112 71.2291 15.2890 128.9448 176.6025 35.7529 761.9241 66.1072 51.1335 283.0586 56.7988 28.8466 14.7081 3.8501 22.8976 25.4726 2.2777 13.8914 6.6560 77.9915 5.6048 7.0647
temp: 298.150 k
press: 1.00000 atm
elementType: 8 8 8 8 8 7 6 6 6 6 6 6 6 6 6 6 6 1 1 1 1 1 1 1 1 1 1 1 1 1 1 1
symmnumber: 1
zpe: 663914.0 jmol-1
zpe.correction: 0.252871 hartree
zpe.thermalcorrener: 0.270023 hartree
zpe.thermalcorrenthalpy: 0.270967 hartree
zpe.thermalcorrgfe: 0.206944 hartree
zpe.sumelectzpe: -857.735621 hartree
zpe.sumelectthermal: -857.718470 hartree
zpe.sumelectthermalent: -857.717526 hartree
zpe.sumelectthermalfe: -857.781549 hartree
dipole: -5.1738 -2.1312 -0.8715
dipole: 5.6630
quadrupole: -79.6688 -98.1143 -110.6900
quadrupole: -9.3748 -2.8891 7.9892
quadrupole: 16.4889 -1.9566 -14.5323 -9.3748 -2.8891 7.9892
hfenergy: -857.9884929 hartree
pointgroup: C01 [X(C11H15N1O5)]
dipole: 2.0366398 0.7625551 -0.4843642 debye
polarizability: 262.3587703|1.0585658|130.2674292|0.7260415|-27.3170404|96.6352015 unknown
InChI: InChI=1S/C11H15NO5/c13-5-3-12(4-6-14)8-1-2-9(11(16)17)10(15)7-8/h1-2,7,13-16H,3-6H2
charge 0 multiplicity 1
32 atoms
O  3.938715 -2.09189 -0.89401
O  4.068581 2.004671 0.9606
O  -2.459804 -1.879326 1.121811
O  -4.469552 1.307238 -0.856173
O  -4.624427 -0.663633 0.355346
N  1.836213 0.047329 -0.023244
C  2.538702 -0.929573 0.830034
C  2.671131 0.951037 -0.837088
C  0.442296 0.095739 -0.071002
C  2.874993 -2.257739 0.117117
C  3.086499 2.250356 -0.112939
C  -0.352777 -0.91559 0.546631
C  -0.239663 1.1766 -0.744907
C  -1.757404 -0.86142 0.507439
C  -2.432742 0.218603 -0.16907
C  -1.631936 1.221947 -0.785728
C  -3.881159 0.2318 -0.189074
H  1.922074 -1.137417 1.723168
H  3.465054 -0.451792 1.199794
H  2.131329 1.2065 -1.766803
H  3.568789 0.38633 -1.151014
H  2.003155 -2.624309 -0.447497
H  3.161353 -3.023821 0.869226
H  2.220518 2.701527 0.397204
H  3.485127 2.977752 -0.853056
H  0.086693 -1.781173 1.045772
H  0.325013 1.988943 -1.208127
H  -2.139152 2.050135 -1.289829
H  4.810887 -2.02362 -0.429063
H  4.951812 1.825988 0.548738
H  -3.45766 -1.692941 0.995902
H  -5.457155 1.205851 -0.801755
