program: Gaussian 09
title: 000247258
version: EM64L-G09RevD.01
frameworkgroup: C1[X(C15H12N4O4)]
method: RPBEPBE
basis: SDD
operation: Freq
keyword: #p
keyword: freq=noraman
keyword: PBEPBE/SDD
title: #p freq=noraman PBEPBE/SDD
converged: NO YES NO NO
title: Mulliken charges:
elementType: O O O O N N N N C C C C C C C C C C C C C C C H H H H H H H H H H H H
charge: -0.189876 -0.275085 -0.213194 -0.207944 -0.027211 -0.423659 0.022450 0.015266 -0.558024 -0.547445 0.304869 0.156429 -0.009396 -0.386373 -0.362362 -0.218163 -0.224637 0.294395 0.261324 -0.289935 -0.498288 0.446387 -0.369286 0.245850 0.245902 0.258110 0.258142 0.247687 0.265255 0.233338 0.235696 0.384868 0.296657 0.335881 0.292370
chargesum: 0.00000
title: Mulliken charges with hydrogens summed into heavy atoms:
elementType: O O O O N N N N C C C C C C C C C C C C C C C
charge: -0.189876 -0.275085 -0.213194 -0.207944 -0.027211 -0.038791 0.022450 0.015266 -0.066271 -0.031194 0.304869 0.156429 -0.009396 -0.138686 -0.097106 0.015176 0.011059 0.294395 0.261324 0.006722 -0.162407 0.446387 -0.076917
polarizability: 5.19852939e+02 3.94477733e+00 2.57072600e+02 -1.05398467e-03 5.21428065e-05 8.32524554e+01
1716.lowfreq: -7.9898 -7.0331 -1.7481 -0.0010 -0.0007 0.0007 22.8641 33.6628 40.2093
frequency: 22.8306 33.6302 40.1970 59.1335 73.7537 83.4550 97.4908 145.7937 149.4954 153.1011 164.4748 198.4792 206.1129 293.8574 305.4504 352.6474 359.7111 376.9025 396.0755 427.2221 445.1106 467.7245 476.3583 501.8344 514.2297 546.5540 550.1739 593.5582 605.1274 633.1208 650.2122 670.0420 686.4526 705.0430 708.1537 722.8292 750.9110 756.1625 772.7185 817.1786 822.4042 833.0767 856.0234 861.2569 887.0436 888.8809 957.9706 963.5295 994.0274 997.5128 1007.9571 1010.2890 1014.3883 1021.6251 1048.2277 1073.2250 1098.4459 1100.5390 1137.3178 1154.9441 1164.9350 1168.9797 1187.9960 1211.3324 1216.9026 1223.9449 1233.5584 1279.0801 1299.7998 1307.5792 1310.5178 1341.3060 1359.2918 1387.4958 1400.1950 1438.7690 1448.9095 1457.0182 1461.1231 1472.2599 1480.6253 1517.4942 1565.3632 1584.3723 1592.6185 1616.3877 1622.5332 2982.1963 3003.9348 3027.8769 3055.1974 3130.2827 3142.5749 3156.4801 3170.9245 3180.6118 3189.0891 3200.1475 3220.7458
redmass: 4.5782 6.9017 6.7812 11.4304 5.1916 5.7994 2.3452 7.4018 9.3082 5.4660 5.3876 8.4778 3.6023 6.7856 8.7343 4.9154 8.9943 8.2946 7.8409 3.0107 3.8387 3.9200 5.3898 9.0703 3.6206 6.4320 2.7705 5.7122 6.4480 7.3585 7.9137 8.6682 7.0098 7.2739 2.1795 4.9106 8.6958 7.5364 1.3651 1.3007 4.9822 1.3951 5.4586 1.4096 1.4022 7.0163 1.4109 1.4044 3.2179 1.3382 1.9794 1.3156 4.4254 2.3396 2.2403 4.3396 2.1579 3.6130 1.3399 1.1610 7.5091 1.2055 1.8914 5.1550 1.1028 1.4871 1.7886 1.5163 2.0759 2.1837 2.2510 4.2380 7.1253 4.8662 5.2103 1.1727 5.6400 2.3973 1.5220 1.6272 3.0470 3.7211 8.3188 5.2322 7.0947 7.2987 7.2838 1.0595 1.0616 1.1019 1.1022 1.0863 1.0901 1.0949 1.1000 1.0891 1.0920 1.0965 1.0792
irintensity: 0.4575 0.8369 0.3120 0.0814 0.4296 0.1247 4.0918 0.4449 2.0661 1.1286 5.1378 3.7777 4.3811 0.2694 1.1690 0.8160 3.9070 4.2704 1.9111 5.0785 1.1695 4.7012 21.9302 1.3035 12.4869 2.6013 0.5161 4.7269 1.2181 14.4428 15.3687 12.6657 0.9158 6.1490 6.3732 1.6266 14.0406 0.1902 83.0521 78.1440 0.1755 22.3889 13.1328 21.0370 0.0003 4.0893 1.2403 24.5637 6.1075 0.0041 2.4182 0.0209 7.3754 0.6217 8.6827 69.8657 31.5639 37.6799 48.6987 0.0005 338.6296 33.8288 3.6483 608.9258 0.2133 32.0208 141.5952 1.6767 82.6144 15.7081 59.1111 254.4069 60.8107 20.4170 31.1486 5.3056 2.9299 28.1378 5.2957 1.5680 68.1437 81.8477 60.1883 220.5487 1.7370 42.5114 519.2380 6.3917 24.7352 1.5668 17.7005 2.8628 9.9881 24.9116 28.7631 3.5235 21.2526 0.1410 61.7784
temp: 298.150 k
press: 1.00000 atm
elementType: 8 8 8 8 7 7 7 7 6 6 6 6 6 6 6 6 6 6 6 6 6 6 6 1 1 1 1 1 1 1 1 1 1 1 1
symmnumber: 1
zpe: 664241.1 jmol-1
zpe.correction: 0.252996 hartree
zpe.thermalcorrener: 0.271872 hartree
zpe.thermalcorrenthalpy: 0.272816 hartree
zpe.thermalcorrgfe: 0.203529 hartree
zpe.sumelectzpe: -1096.915777 hartree
zpe.sumelectthermal: -1096.896901 hartree
zpe.sumelectthermalent: -1096.895956 hartree
zpe.sumelectthermalfe: -1096.965244 hartree
dipole: -10.2491 -0.5000 -0.0015
dipole: 10.2613
quadrupole: -150.8185 -139.2843 -133.1104
quadrupole: 0.7740 -0.0018 0.0056
quadrupole: -9.7474 1.7868 7.9606 0.7740 -0.0018 0.0056
hfenergy: -1097.1687726 hartree
pointgroup: C01 [X(C15H12N4O4)]
dipole: 4.0346595 -0.1400265 0.0009394 debye
polarizability: 519.9118995|-0.2508798|257.013539|0.0469864|0.1290434|83.2525563 unknown
InChI: InChI=1S/C15H12N4O4/c20-18(21)11-6-8-14(15(9-11)19(22)23)17-16-13-7-5-10-3-1-2-4-12(10)13/h1-4,6,8-9,17H,5,7H2
charge 0 multiplicity 1
35 atoms
O  -3.398192 3.141732 0.002769
O  -1.127208 2.954778 0.002611
O  -5.403192 -2.807365 -0.003216
O  -6.28331 -0.697219 -0.000147
N  1.08366 -0.251073 0.000201
N  -0.011906 0.607246 0.001151
N  -2.331778 2.419805 0.002453
N  -5.28364 -1.517649 -0.001321
C  4.145264 1.931654 0.001054
C  2.585594 1.839574 0.00218
C  4.620987 0.484997 0.000939
C  3.521149 -0.416362 0.000558
C  2.268002 0.340791 0.000801
C  5.939079 -0.011844 0.000913
C  3.72049 -1.819238 0.000198
C  6.1437 -1.412573 0.000554
C  5.041844 -2.309845 0.0002
C  -1.288802 0.099677 0.000484
C  -2.44845 0.964144 0.001236
C  -1.514789 -1.317215 -0.001019
C  -3.755987 0.430726 0.000734
C  -3.921543 -0.958416 -0.000706
C  -2.803162 -1.841435 -0.001652
H  4.518637 2.477314 0.887017
H  4.517185 2.476743 -0.885883
H  2.146677 2.338279 -0.884179
H  2.148358 2.335877 0.890721
H  6.795914 0.670974 0.001139
H  2.860595 -2.495975 -0.000004
H  7.163936 -1.811966 0.000573
H  5.224661 -3.389686 -0.000019
H  0.05339 1.646292 0.002626
H  -0.635346 -1.963641 -0.001626
H  -4.619861 1.100232 0.001399
H  -2.980953 -2.919832 -0.00284
