program: Gaussian 09
title: 000247269
version: EM64L-G09RevD.01
frameworkgroup: C1[X(C22H28N2O4)]
method: RPBEPBE
basis: SDD
operation: Freq
keyword: #p
keyword: freq=noraman
keyword: PBEPBE/SDD
title: #p freq=noraman PBEPBE/SDD
converged: YES YES NO NO
title: Mulliken charges:
elementType: O O O O N N C C C C C C C C C C C C C C C C C C C C C C H H H H H H H H H H H H H H H H H H H H H H H H H H H H
charge: -0.243498 -0.243499 -0.232966 -0.232966 -0.055697 -0.055698 -0.359235 -0.359235 -0.441415 -0.441415 0.476663 0.476663 -0.359480 -0.359479 -0.519370 -0.519370 -0.425985 -0.425986 0.220282 0.220283 0.203055 0.203056 -0.320285 -0.320285 -0.537680 -0.537680 -0.538525 -0.538525 0.217045 0.201183 0.217044 0.201183 0.164423 0.222991 0.164423 0.222991 0.196026 0.196026 0.241677 0.241678 0.272095 0.272095 0.242091 0.242091 0.219459 0.219512 0.247113 0.219512 0.219460 0.247113 0.221519 0.221769 0.247231 0.221769 0.221519 0.247231
chargesum: 0.00000
title: Mulliken charges with hydrogens summed into heavy atoms:
elementType: O O O O N N C C C C C C C C C C C C C C C C C C C C C C
charge: -0.243498 -0.243499 -0.232966 -0.232966 -0.055697 -0.055698 0.058993 0.058993 -0.054001 -0.054001 0.476663 0.476663 -0.163454 -0.163453 -0.277693 -0.277693 -0.153890 -0.153891 0.220282 0.220283 0.203055 0.203056 -0.078194 -0.078194 0.148405 0.148405 0.151994 0.151995
polarizability: 4.86798492e+02 1.20083669e+01 2.81134141e+02 -6.56370660e+01 1.38055521e+00 1.67414745e+02
1716.lowfreq: -4.0751 -0.0011 0.0015 0.0018 1.8938 3.7664 8.3784 9.7018 14.7031
frequency: 8.3784 9.7018 14.7031 19.4867 29.8114 61.3850 67.5455 85.7716 91.3535 92.4459 95.9901 109.1856 110.0745 151.1422 155.8051 161.8432 171.0651 176.1429 178.3567 218.5087 223.5106 226.6284 227.9864 245.5175 249.9853 262.3969 278.0959 296.1598 297.0410 302.1698 318.1176 359.9720 367.8536 371.8789 380.9023 400.2612 404.7485 461.3618 463.8122 468.0378 481.1129 493.6508 539.7163 578.4661 580.2234 608.4597 608.8138 622.2596 625.8958 729.8343 730.6059 741.4004 745.6422 745.9737 764.8242 781.9197 820.6580 822.0103 827.7272 859.2257 860.1266 899.7568 905.0816 919.5995 934.0945 953.5387 955.6149 970.6848 979.5681 981.8931 982.2117 985.8796 1000.7957 1001.0828 1041.1649 1051.9609 1097.8871 1111.1365 1111.1378 1111.8876 1111.8881 1117.7834 1122.0762 1124.6123 1145.3867 1145.7451 1156.6213 1156.7702 1179.4519 1183.7873 1184.4873 1208.1199 1224.3618 1225.2467 1235.1355 1263.6822 1264.6689 1290.8138 1291.1963 1292.8349 1306.4000 1323.7575 1328.9958 1356.8295 1360.5039 1365.7038 1400.8632 1401.0694 1413.0115 1413.0208 1437.2838 1437.3135 1442.8534 1442.9573 1449.3432 1461.5779 1463.3521 1466.4803 1466.4813 1467.2799 1467.7259 1467.7300 1470.5020 1470.6926 1471.7978 1471.8269 1509.1131 1509.4792 1582.3733 1582.6759 1604.1313 1604.3956 1626.7306 1627.5091 2879.9888 2880.0465 2893.1796 2893.7002 2954.2601 2954.2811 2959.6852 2959.7329 2978.4682 2984.1111 3007.4875 3008.9563 3033.0301 3040.5193 3040.5318 3048.3009 3048.3103 3058.6858 3124.5987 3124.6168 3127.6528 3127.6656 3141.9238 3141.9371 3150.5572 3150.5652 3170.7014 3170.7103
redmass: 4.8945 4.5200 4.7492 5.2679 5.0869 4.5625 4.0346 4.1246 3.2526 3.2861 2.9918 3.2808 3.4525 3.5618 3.2414 3.5025 2.9261 3.3296 3.5513 2.8198 1.5892 1.4553 2.3781 1.3988 1.2508 2.1040 2.6623 2.4867 2.6423 3.7995 4.7045 3.2825 3.6396 3.6907 4.1007 3.3894 3.3516 3.6622 3.1649 4.1940 6.6541 4.3678 2.9172 4.4663 4.4259 5.3627 4.9381 3.7272 3.6515 4.5249 5.1806 1.9626 2.9065 2.8510 5.1450 2.5280 1.4870 1.4471 1.9890 1.6027 1.6257 2.6466 3.0839 4.2225 2.7342 1.3529 1.3995 1.6558 1.6676 7.5264 7.0618 1.6968 4.3845 4.0776 3.5067 2.9750 2.4303 1.2625 1.2625 1.2601 1.2601 2.0205 1.7965 1.8595 1.5449 1.5587 1.4031 1.4019 1.2876 1.6331 1.5611 1.2357 2.0773 2.0100 1.1861 2.4350 2.3675 1.9762 1.9867 1.1586 1.2832 1.3150 1.3472 1.9489 1.8685 1.5206 2.3613 2.3482 3.7246 3.7129 1.1940 1.1930 1.3586 1.3699 1.0836 1.0931 1.1113 1.0512 1.0513 1.1093 1.0505 1.0508 1.0848 1.0820 1.0571 1.0581 2.8022 2.8285 8.0224 8.0232 6.0622 6.1064 7.2379 7.2529 1.0702 1.0702 1.0820 1.0816 1.0333 1.0333 1.0330 1.0330 1.0613 1.0620 1.0901 1.0880 1.0993 1.1037 1.1037 1.1039 1.1039 1.1039 1.0988 1.0988 1.0993 1.0993 1.0901 1.0901 1.0871 1.0871 1.0961 1.0961
irintensity: 0.0654 0.2218 0.0297 0.0000 0.0000 0.0000 3.9992 2.9228 0.0000 18.2043 0.0000 0.0000 11.7587 17.8245 0.0000 8.0174 0.0000 0.0000 14.6526 2.8218 0.0000 2.6154 0.0000 1.6223 0.0000 2.2968 0.0000 0.0000 0.4001 17.1334 0.0000 10.6485 0.0000 25.6044 0.0000 6.6654 0.0000 7.8033 0.0000 0.9943 0.0000 8.6440 0.0000 34.7865 0.0000 0.0000 23.2498 19.9734 0.0000 55.5345 0.0000 2.3854 0.0000 3.5940 0.0000 6.8199 0.0000 74.5005 0.0000 46.2256 0.0003 0.0000 6.3165 0.0000 17.2965 0.0000 1.9926 15.8639 0.0000 77.8207 0.0001 56.3969 0.0000 89.6574 17.8491 0.0000 0.0000 0.1742 0.3337 0.2928 0.2116 0.0000 271.4777 0.0000 22.6982 0.0000 22.1565 0.0000 3.2222 0.0000 125.8511 11.0497 0.0000 93.0620 0.0000 544.1620 0.0000 257.7033 0.0003 0.0000 5.9906 0.0000 94.9871 0.0000 23.3023 0.0000 0.0000 15.2053 0.0096 16.9756 34.8775 0.0012 0.0001 18.9924 0.0000 93.8323 26.0810 16.9257 6.9155 0.0000 32.8411 0.3354 153.8109 0.0005 83.7619 0.0059 287.8856 0.0000 167.2433 0.0002 254.4147 0.0015 140.2702 0.0004 0.0176 123.2585 0.0006 241.9840 1.9348 145.5078 137.3357 0.2382 0.0000 48.2879 0.0002 95.6087 0.0000 7.1999 89.7992 9.1541 90.7038 75.3186 49.2921 2.1674 53.3188 0.0669 4.7114 16.0765 11.7691 0.7089 16.0316 1.4083
temp: 298.150 k
press: 1.00000 atm
elementType: 8 8 8 8 7 7 6 6 6 6 6 6 6 6 6 6 6 6 6 6 6 6 6 6 6 6 6 6 1 1 1 1 1 1 1 1 1 1 1 1 1 1 1 1 1 1 1 1 1 1 1 1 1 1 1 1
symmnumber: 1
zpe: 1201225.9 jmol-1
zpe.correction: 0.457523 hartree
zpe.thermalcorrener: 0.486921 hartree
zpe.thermalcorrenthalpy: 0.487865 hartree
zpe.thermalcorrgfe: 0.392298 hartree
zpe.sumelectzpe: -1263.339986 hartree
zpe.sumelectthermal: -1263.310587 hartree
zpe.sumelectthermalent: -1263.309643 hartree
zpe.sumelectthermalfe: -1263.405211 hartree
dipole: 0.0000 0.0000 0.0000
dipole: 0.0000
quadrupole: -157.1810 -129.0933 -171.9825
quadrupole: 6.9480 -3.9959 -4.0725
quadrupole: -4.4287 23.6590 -19.2302 6.9480 -3.9959 -4.0725
hfenergy: -1263.7975083 hartree
pointgroup: C01 [X(C22H28N2O4)]
dipole: -0.0000029 0.0000031 0.0000091 debye
polarizability: 485.5947378|-34.3082707|274.4864154|-59.733019|-28.2140341|175.2662249 unknown
InChI: InChI=1S/C22H28N2O4/c1-25-19-9-7-17(13-21(19)27-3)15-23-11-5-6-12-24-16-18-8-10-20(26-2)22(14-18)28-4/h7-10,13-16H,5-6,11-12H2,1-4H3
charge 0 multiplicity 1
56 atoms
O  -8.011997 -1.244248 0.741502
O  8.013874 1.250559 -0.747269
O  -8.571244 1.270063 0.136754
O  8.573169 -1.263753 -0.142565
N  -2.325553 -0.035211 -1.357573
N  2.327451 0.04138 1.351781
C  0.090711 0.052624 -0.766752
C  -0.088814 -0.046494 0.760968
C  -1.017409 -0.690234 -1.551104
C  1.019296 0.696378 1.54532
C  -4.65427 -0.170143 -0.619951
C  4.656167 0.176365 0.614161
C  -3.310035 -0.732004 -0.855724
C  3.311922 0.738198 0.849943
C  -5.664006 -0.999824 -0.054069
C  5.665888 1.006076 0.048295
C  -4.966093 1.172238 -0.940487
C  4.968015 -1.166016 0.934674
C  -6.959497 -0.503447 0.189766
C  6.961388 0.509727 -0.195547
C  -7.265032 0.858654 -0.137474
C  7.266949 -0.852374 0.131668
C  -6.258651 1.679865 -0.700939
C  6.260584 -1.673614 0.695118
C  -7.734667 -2.639091 1.087491
C  7.736519 2.645405 -1.093225
C  -8.920522 2.656172 -0.184925
C  8.922472 -2.649862 0.179089
H  1.071363 -0.373004 -1.054489
H  0.086407 1.116926 -1.075858
H  -1.06947 0.379125 1.048703
H  -0.0845 -1.110796 1.070074
H  -1.024511 -1.767255 -1.250693
H  -0.776054 -0.640499 -2.631584
H  1.026379 1.773401 1.244915
H  0.777946 0.646632 2.6258
H  -3.181817 -1.804456 -0.574132
H  3.183685 1.810652 0.568368
H  -5.418672 -2.038778 0.192176
H  5.420534 2.045028 -0.197933
H  -4.181852 1.79812 -1.376719
H  4.183786 -1.79192 1.370894
H  -6.482026 2.720245 -0.955417
H  6.483978 -2.713994 0.949579
H  -7.444817 -3.227569 0.194534
H  -6.939362 -2.715011 1.855201
H  -8.68082 -3.024615 1.49446
H  6.941214 2.721329 -1.860934
H  7.446658 3.233856 -0.200255
H  8.682666 3.030956 -1.500185
H  -8.301285 3.371684 0.390464
H  -8.812161 2.858202 -1.268411
H  -9.975419 2.757071 0.108628
H  8.814115 -2.851913 1.262571
H  8.303249 -3.365374 -0.396314
H  9.977371 -2.750736 -0.114466
