program: Gaussian 09
title: 000247183
version: EM64L-G09RevD.01
frameworkgroup: C1[X(C8H12O2)]
method: RPBEPBE
basis: SDD
operation: Freq
keyword: #pfreq=noraman
keyword: PBEPBE/SDD
title: #p freq=noraman PBEPBE/SDD
converged: YES YES NO NO
title: Mulliken charges:
elementType: O O C C C C C C C C H H H H H H H H H H H H
charge: -0.298988 -0.298988 -0.145634 -0.145626 -0.482171 -0.482173 -0.091948 -0.091951 -0.360805 -0.360804 0.247394 0.247391 0.240764 0.219306 0.240765 0.219304 0.240849 0.240851 0.217678 0.213554 0.217678 0.213554
chargesum: 0.00000
title: Mulliken charges with hydrogens summed into heavy atoms:
elementType: O O C C C C C C C C
charge: -0.298988 -0.298988 0.101759 0.101765 -0.022101 -0.022103 0.148901 0.148900 0.070427 0.070428
polarizability: 9.11569012e+01 2.47504350e-05 9.89754557e+01 -8.13499107e-01 -2.91919309e-05 6.88904406e+01
1716.lowfreq: -22.1368 -14.4331 -12.3428 -0.0011 -0.0005 0.0003 28.8241 60.1961 75.7682
frequency: 28.8176 60.1267 75.6877 150.4948 153.7586 231.5320 300.4321 336.6496 355.9134 431.1662 500.4854 621.7906 726.6907 737.5577 768.1707 795.8054 812.4837 850.5463 888.6416 910.4023 948.7310 950.5371 979.7074 1012.7934 1028.1475 1072.5863 1074.8713 1093.1982 1098.9820 1101.3545 1112.8317 1127.4355 1182.5059 1187.0144 1207.7687 1212.0136 1235.6757 1236.7744 1236.9660 1245.3540 1275.3414 1287.9611 1398.8715 1409.0799 1461.1352 1472.9085 1477.8576 1477.8584 3006.8719 3011.8407 3017.8137 3018.8560 3056.0716 3057.0928 3072.8084 3073.7273 3088.1132 3103.7280 3161.6697 3161.7566
redmass: 4.6773 3.8514 2.3765 2.5831 4.0784 2.5867 5.3686 4.2496 2.9016 2.9815 3.3541 2.0958 5.4486 8.1525 2.0569 1.3900 4.1594 3.2802 1.9500 1.4630 1.2796 2.1734 2.1153 1.1274 1.4870 2.6147 2.0272 1.8083 1.3106 1.3871 1.3913 1.4231 1.6202 1.6050 1.5335 1.1836 1.5652 1.4317 1.3969 1.4898 1.3156 1.4224 2.1138 2.2072 1.0853 1.1276 1.2116 1.2098 1.0853 1.0676 1.0662 1.0754 1.0527 1.0526 1.0909 1.0908 1.1042 1.1054 1.1186 1.1186
irintensity: 4.9037 8.6432 0.0902 0.0005 11.6498 0.3828 4.0564 0.6122 1.1599 0.1749 21.1091 10.7317 9.6420 8.6926 0.5649 9.8864 59.3164 6.7001 12.6768 1.0878 2.3782 8.9260 0.6732 1.3852 1.8438 1.3127 2.2869 6.0423 8.5175 5.1011 5.2576 4.1625 0.1965 0.1346 4.6206 0.0009 0.1050 2.0568 2.8294 7.9998 12.7131 5.5279 15.7769 1.8627 6.8686 6.0829 2.3501 2.8830 3.9912 24.3676 27.0431 30.4052 8.0986 53.3516 0.0868 33.3292 18.2174 61.7618 63.9069 5.1372
temp: 298.150 k
press: 1.00000 atm
elementType: 8 8 6 6 6 6 6 6 6 6 1 1 1 1 1 1 1 1 1 1 1 1
symmnumber: 1
zpe: 479545.6 jmol-1
zpe.correction: 0.182649 hartree
zpe.thermalcorrener: 0.192730 hartree
zpe.thermalcorrenthalpy: 0.193674 hartree
zpe.thermalcorrgfe: 0.145677 hartree
zpe.sumelectzpe: -461.584523 hartree
zpe.sumelectthermal: -461.574442 hartree
zpe.sumelectthermalent: -461.573498 hartree
zpe.sumelectthermalfe: -461.621495 hartree
dipole: 0.0000 -0.8453 0.0001
dipole: 0.8453
quadrupole: -83.3198 -53.0992 -56.6079
quadrupole: 0.0000 6.0580 0.0000
quadrupole: -18.9775 11.2431 7.7343 0.0000 6.0580 0.0000
hfenergy: -461.7671724 hartree
pointgroup: C01 [X(C8H12O2)]
dipole: 0.0001109 0.3325621 0.0001193 debye
dipolederiv: -0.7675758 -0.0338994 -0.0848015 0.0049535 -0.3137688 0.0639451 -0.1104297 0.0448385 -0.3739478 -0.7675433 0.0342947 -0.0848378 -0.0045423 -0.3137341 -0.0638504 -0.1104768 -0.0447214 -0.3740124 -0.0202243 0.0128974 -0.0353757 -0.0102092 0.0169435 -0.0145773 0.0527261 -0.0536925 0.0772686 -0.0202175 -0.0128534 -0.0353687 0.0102085 0.0169098 0.0145721 0.0527806 0.0536171 0.0773032 -0.0057368 -0.0495345 0.0206145 -0.0592005 0.002639 -0.0583213 0.0105621 -0.0012971 0.1622388 -0.0056553 0.0495295 0.0206859 0.059202 0.0025212 0.0582174 0.0105935 0.0012019 0.1622746 0.4281775 0.1781894 -0.0218707 0.0823108 0.1538897 -0.0177115 -0.1270397 -0.0076947 0.2926544 0.4279658 -0.1783836 -0.0219607 -0.0824514 0.1540766 0.0176548 -0.127083 0.0077154 0.2926612 0.1728647 -0.1190842 -0.0943879 -0.0085649 0.1425618 -0.0360972 -0.0596729 -0.0723958 0.2391972 0.1729701 0.1191083 -0.0942979 0.0085719 0.1424061 0.0361174 -0.059615 0.0723926 0.2392496 0.0640619 -0.0249516 0.0274679 -0.0251379 0.0199583 -0.0652906 0.0187032 -0.046222 -0.115429 0.0640997 0.024903 0.0275335 0.0250928 0.0198599 0.0653428 0.0187546 0.0462818 -0.1153678 -0.0007936 0.0784482 -0.0631059 0.0632102 -0.0489993 0.0730503 -0.0907002 0.1219157 -0.0220137 0.0024283 0.0346076 0.0788863 0.0233429 0.0642616 -0.008797 0.1103829 -0.0669552 -0.1023379 -0.0009022 -0.0784515 -0.063205 -0.0631985 -0.0487834 -0.0730146 -0.0908286 -0.1218585 -0.0221187 0.0023851 -0.0346026 0.0788739 -0.0233557 0.0642628 0.008827 0.1104224 0.0669609 -0.102299 0.0286635 -0.0535714 0.0136704 -0.0362611 0.0385179 -0.0787107 0.0295501 -0.0361658 -0.1180552 0.028733 0.0535697 0.0137693 0.0362495 0.0383871 0.0787869 0.0296052 0.0362281 -0.1179872 0.0584781 -0.0276035 0.0572423 -0.0375309 -0.0862553 0.083722 0.0539414 0.1161398 0.0032769 0.0397129 0.1004956 0.1016562 0.0559358 0.0102289 -0.0153949 0.1119692 -0.0489712 -0.0428856 0.0585233 0.0274676 0.0571958 0.0373946 -0.0861982 -0.0838139 0.0538742 -0.116228 0.0031744 0.0395848 -0.1005751 0.1016159 -0.0560199 0.0103147 0.0153435 0.1119804 0.0489107 -0.0428444 unknown
polarizability: 91.0747498|0.0026535|98.9754527|1.57616|0.0073605|68.972595 unknown
InChI: InChI=1S/C8H12O2/c1-2-6(8-4-10-8)5(1)7-3-9-7/h5-8H,1-4H2
charge 0 multiplicity 1
22 atoms
O  3.025423 0.663888 0.359453
O  -3.026776 0.666415 -0.358175
C  0.736111 -0.507698 0.288242
C  -0.738375 -0.506967 -0.287527
C  0.780199 -2.059158 0.052543
C  -0.783673 -2.058522 -0.052678
C  1.747363 0.365911 -0.406627
C  -1.74897 0.367042 0.407792
C  2.038818 1.763249 0.053841
C  -2.039336 1.764851 -0.051933
H  0.736819 -0.27474 1.370102
H  -0.738898 -0.273425 -1.369262
H  1.239547 -2.668729 0.846071
H  1.260984 -2.309804 -0.910442
H  -1.243496 -2.667304 -0.846536
H  -1.264646 -2.309322 0.910174
H  1.937951 0.127891 -1.463878
H  -1.939786 0.128592 1.464904
H  2.389634 2.512512 -0.666888
H  1.505236 2.157431 0.929183
H  -2.389606 2.513995 0.669185
H  -1.50542 2.159094 -0.927044
