program: Gaussian 09
title: 000247191
version: EM64L-G09RevD.01
frameworkgroup: C1[X(C11H10BrN3O2S)]
method: RPBEPBE
basis: SDD
operation: Freq
keyword: #p
keyword: freq=noraman
keyword: PBEPBE/SDD
title: #p freq=noraman PBEPBE/SDD
converged: NO YES NO NO
title: Mulliken charges:
elementType: Br S O O N N N C C C C C C C C C C C H H H H H H H H H H
charge: 0.010644 0.240235 -0.373201 -0.282794 -0.461675 -0.329840 0.072221 0.053803 0.388102 0.094560 0.079161 -0.434570 -0.425595 -0.238288 -0.145395 -0.164933 -0.248088 -0.800392 0.339324 0.247761 0.306368 0.348686 0.252236 0.253662 0.388760 0.245870 0.291283 0.292097
chargesum: 0.00000
title: Mulliken charges with hydrogens summed into heavy atoms:
elementType: Br S O O N N N C C C C C C C C C C C
charge: 0.010644 0.240235 0.015558 -0.282794 -0.122351 0.018846 0.072221 0.053803 0.388102 0.094560 0.079161 -0.186809 -0.119227 -0.238288 0.106841 0.088729 -0.248088 0.028858
polarizability: 3.61501651e+02 -1.06403542e+01 1.80802482e+02 -1.07770181e+01 3.42527384e+00 8.96736394e+01
1716.lowfreq: -5.6738 -3.2302 -3.1024 -0.0010 -0.0009 0.0017 26.5309 35.4404 41.6630
frequency: 26.5203 35.3938 41.6276 56.0561 82.1902 111.2647 121.9333 152.1474 162.5808 175.1597 203.2052 213.5104 277.7327 281.8670 320.7731 325.2589 327.8763 359.6899 394.3630 418.0723 468.3697 501.3841 520.0408 549.5482 566.6991 588.8477 600.9283 623.3178 628.7116 653.1296 667.8932 697.4424 706.9425 738.6079 771.9795 816.3369 840.4739 843.2683 906.2632 948.8347 966.9086 985.4230 987.2407 997.4309 1044.4910 1061.9773 1102.6823 1118.3339 1187.9532 1202.0551 1212.5244 1275.0218 1287.7532 1302.2437 1346.7667 1367.6741 1383.9299 1406.2029 1416.9697 1431.5785 1448.9406 1472.7233 1508.5133 1546.1444 1561.0595 1574.4616 1605.9384 1614.0878 3030.8907 3138.7849 3148.7704 3158.8815 3166.9439 3169.8983 3173.0988 3443.7175 3460.0643 3509.0275
redmass: 7.9324 4.0779 3.2445 3.4706 1.5121 6.8810 6.1401 4.4631 8.4439 11.6207 6.6867 6.3122 6.4295 6.1208 4.7536 4.8857 7.2276 6.7228 1.3026 3.1503 6.2987 2.9895 9.4994 7.3723 3.5572 2.9269 2.8861 7.1273 5.3960 5.3906 5.9229 4.0810 1.7868 4.3394 5.5862 1.7223 2.3019 1.6781 9.6466 1.3162 1.3080 4.6715 1.1753 1.3007 4.8452 2.6592 3.1542 1.3570 1.1256 1.8865 3.7680 2.4456 2.3717 1.6785 1.1388 4.2172 3.1331 3.9462 2.3508 1.0514 1.0686 2.2876 2.3202 5.8564 9.6855 4.6104 6.3752 6.2548 1.0279 1.0897 1.0885 1.1046 1.1062 1.0956 1.0966 1.0664 1.0749 1.0780
irintensity: 0.5277 2.1018 1.1458 0.3335 1.2310 2.9689 0.9363 0.0771 1.7842 5.1537 13.8968 0.9630 1.3641 1.7456 4.7033 8.7225 18.1504 16.9831 136.0171 4.8643 15.1358 26.6629 0.8455 10.3936 61.6545 44.5015 28.5385 1.6079 20.9823 10.0990 6.8659 7.5992 65.2824 40.3911 28.1962 23.6242 42.9416 3.6869 37.5643 0.4284 2.5509 30.5001 8.7595 8.7694 13.1078 34.7045 23.6930 6.6811 28.4539 59.0589 135.7054 37.0339 24.5455 16.6871 3.9816 70.4061 85.6764 11.2991 4.0121 15.3710 15.1694 90.7426 596.8836 337.7106 209.8910 49.4598 179.0094 433.3467 16.4633 6.0989 6.5842 6.1466 6.3927 6.2131 0.7977 154.9511 95.6846 57.2257
temp: 298.150 k
press: 1.00000 atm
elementType: 35 16 8 8 7 7 7 6 6 6 6 6 6 6 6 6 6 6 1 1 1 1 1 1 1 1 1 1
symmnumber: 1
zpe: 517644.2 jmol-1
zpe.correction: 0.197160 hartree
zpe.thermalcorrener: 0.214645 hartree
zpe.thermalcorrenthalpy: 0.215589 hartree
zpe.thermalcorrgfe: 0.149104 hartree
zpe.sumelectzpe: -1150.114930 hartree
zpe.sumelectthermal: -1150.097445 hartree
zpe.sumelectthermalent: -1150.096501 hartree
zpe.sumelectthermalfe: -1150.162987 hartree
dipole: 2.3151 -0.7681 0.2805
dipole: 2.4552
quadrupole: -112.5775 -123.5373 -123.6871
quadrupole: -12.0971 -3.3322 7.4267
quadrupole: 7.3565 -3.6034 -3.7531 -12.0971 -3.3322 7.4267
hfenergy: -1150.3120906 hartree
pointgroup: C01 [X(C11H10Br1N3O2S1)]
dipole: 0.9430739 0.1975012 -0.0685147 debye
polarizability: 358.4090583|-3.4934218|179.0088344|32.8431043|-11.6618295|94.5598793 unknown
InChI: InChI=1S/C11H10BrN3O2S/c1-18-11-14-9(16)8(10(17)15-11)13-7-4-2-6(12)3-5-7/h2-5,13-14,17H,1H3
charge 0 multiplicity 1
28 atoms
Br -6.042709 1.615974 -0.357261
S  5.063041 0.60927 0.845642
O  0.50563 1.361585 -1.187608
O  1.337347 -2.818043 1.174583
N  -0.55888 -1.269424 -0.072218
N  2.969359 -1.140213 0.949354
N  2.517151 0.909636 -0.157755
C  0.724572 -0.727421 0.123322
C  -1.789078 -0.586326 -0.117829
C  1.650458 -1.644847 0.789261
C  1.228431 0.48036 -0.396187
C  -2.93322 -1.26397 -0.632073
C  -1.938319 0.75272 0.352094
C  3.345331 0.116094 0.496333
C  -4.183369 -0.622807 -0.692049
C  -3.193559 1.400171 0.279367
C  -4.302676 0.71435 -0.248822
C  5.068635 2.288887 0.001081
H  -0.58057 -2.287565 0.065605
H  -2.83447 -2.292988 -0.995366
H  -1.1131 1.256492 0.865256
H  3.634618 -1.760192 1.422981
H  -5.052452 -1.15424 -1.090209
H  -3.297373 2.423718 0.650956
H  -0.456996 1.11076 -1.248955
H  6.082726 2.687837 0.156191
H  4.309763 2.931996 0.466038
H  4.847712 2.160183 -1.066832
