program: Gaussian 09
title: 000247180
version: EM64L-G09RevD.01
frameworkgroup: C1[X(C9H7NO3)]
method: RPBEPBE
basis: SDD
operation: Freq
keyword: #pfreq=noraman
keyword: PBEPBE/SDD
title: #p freq=noraman PBEPBE/SDD
converged: YES YES NO NO
title: Mulliken charges:
elementType: O O O N C C C C C C C C C H H H H H H H
charge: -0.233523 -0.241163 -0.196152 -0.243400 0.140135 0.241050 0.201887 -0.312065 0.203858 -0.347902 -0.600377 -0.238709 -0.189253 0.276904 0.269787 0.273577 0.255911 0.256118 0.241228 0.242088
chargesum: 0.00000
title: Mulliken charges with hydrogens summed into heavy atoms:
elementType: O O O N C C C C C C C C C
charge: -0.233523 -0.241163 -0.196152 -0.243400 0.140135 0.241050 0.201887 -0.035160 0.203858 -0.078115 0.185229 0.002519 0.052835
polarizability: 1.64057179e+02 2.89242403e+00 1.22177202e+02 -6.20385050e-02 3.11768302e-02 4.85901193e+01
1716.lowfreq: -12.4029 -0.0010 -0.0008 -0.0008 4.4652 9.3530 81.0355 90.8775 109.3603
frequency: 81.0257 90.8764 109.3584 153.7170 255.8907 256.4058 276.0892 336.1106 379.4508 409.9081 434.3825 444.6972 515.7334 531.7149 638.2282 656.3853 666.8053 672.7476 688.7908 756.3072 785.5500 853.2126 881.5091 885.7325 974.8061 998.0415 1001.8284 1018.3706 1037.4363 1101.1485 1130.6952 1163.1190 1194.9087 1195.7519 1258.9721 1268.5356 1315.6881 1402.9641 1424.4248 1449.5208 1467.2262 1475.8032 1478.0871 1585.9788 1615.9510 1623.1898 1691.8102 3017.1517 3111.7735 3145.2611 3146.6037 3158.4114 3173.4955 3183.2484
redmass: 4.9269 3.6783 1.1351 6.8309 6.1781 4.7823 4.6930 3.8854 10.2807 6.1216 3.4546 9.0341 3.7325 11.4236 7.3891 7.9583 6.6251 5.3540 8.2065 2.9748 1.5894 5.7563 6.9704 1.4140 1.3673 5.2523 1.3335 2.5087 2.3913 1.9271 1.3098 1.3082 2.4258 2.3863 3.1448 1.9024 3.2563 10.6551 1.1956 2.5393 2.4874 1.0672 1.0890 7.9151 8.1999 9.1094 11.2314 1.0329 1.1027 1.0868 1.1023 1.0907 1.0962 1.0994
irintensity: 4.7938 4.0001 0.0220 1.7556 0.0478 1.7326 0.0005 7.0021 19.6313 12.0213 1.4185 3.0307 5.6858 0.5335 6.3622 8.8190 0.3416 2.0113 29.4343 51.9670 46.4923 10.5877 24.8955 0.4571 3.2221 93.4490 0.0491 22.2934 32.9778 38.9647 0.1247 7.7276 59.9430 9.4503 45.4337 10.0579 279.2999 8.3992 101.8578 113.7209 2.1483 21.5213 24.1412 34.9889 275.7441 225.3623 366.6370 20.9483 13.9135 3.9385 0.8010 4.0463 8.6417 8.7081
temp: 298.150 k
press: 1.00000 atm
elementType: 8 8 8 7 6 6 6 6 6 6 6 6 6 1 1 1 1 1 1 1
symmnumber: 1
zpe: 380238.0 jmol-1
zpe.correction: 0.144825 hartree
zpe.thermalcorrener: 0.155268 hartree
zpe.thermalcorrenthalpy: 0.156212 hartree
zpe.thermalcorrgfe: 0.108550 hartree
zpe.sumelectzpe: -626.692220 hartree
zpe.sumelectthermal: -626.681778 hartree
zpe.sumelectthermalent: -626.680833 hartree
zpe.sumelectthermalfe: -626.728495 hartree
dipole: 3.1071 0.6981 -0.0032
dipole: 3.1846
quadrupole: -62.1991 -84.9510 -75.2749
quadrupole: -7.5009 0.0145 0.0116
quadrupole: 11.9426 -10.8093 -1.1333 -7.5009 0.0145 0.0116
hfenergy: -626.8370455 hartree
pointgroup: C01 [X(C9H7N1O3)]
dipole: 1.230269 0.2370975 -0.002187 debye
dipolederiv: -1.7243041 -0.270956 0.0017866 0.0558285 -0.4507294 0.0010764 0.000219 0.0011686 -0.1887683 -0.6234248 0.1230122 -0.0003493 0.1008151 -1.1167795 0.0032736 -0.001389 0.0030974 -0.344456 -1.1474311 -0.4492498 0.0019726 -0.4411136 -0.7952661 0.0018927 0.0035063 0.0030275 -0.3443553 -0.9588042 -0.3402688 0.0025747 -0.3278641 -1.2023817 0.0038896 -0.0013445 0.0045211 -0.1996075 -0.6693426 0.2546323 -0.0011413 0.107513 -0.280952 0.0008397 -0.0000184 0.001114 -0.0304822 0.9898987 0.3333333 -0.0012877 0.2449453 0.3343071 -0.0009147 -0.0009816 -0.0006784 0.1167785 1.5311923 0.1053311 -0.0006156 0.0710267 1.4249974 -0.004431 -0.0000456 -0.0044647 0.2516663 0.1801663 -0.1637581 0.0006243 0.1112369 0.0677284 -0.0004983 -0.0003045 -0.0006333 -0.0851547 2.1120506 0.4435447 -0.0032753 0.1666219 1.5765012 -0.005363 -0.0032324 -0.0066626 0.350455 -0.4185806 -0.1366193 0.0005893 -0.0134914 0.0742709 -0.0008401 -0.000239 -0.0010156 -0.1605939 0.3429144 -0.099709 -0.0017857 -0.1862284 0.0963657 0.0018146 0.0001701 0.0021796 0.1985754 -0.035947 0.1995909 -0.0007233 0.184668 -0.1793776 0.0000246 -0.0007041 0.0000214 -0.1708451 0.1466561 0.0088327 -0.0000247 -0.05439 0.1791775 -0.0011784 0.0002918 -0.0011124 -0.1206654 0.1211627 0.0332955 -0.0001385 -0.0225301 0.0047742 0.0005497 0.00011 0.0005826 0.1561512 0.1023722 -0.0167168 0.0000557 0.0069419 -0.0218221 0.0007598 -0.0000453 0.0007491 0.1790994 0.1691184 -0.0695098 0.0023747 0.0659698 -0.0050332 0.0041263 0.0011082 0.0026029 0.1311177 0.0000897 0.0217306 0.0460476 -0.0287281 0.0998708 0.0745982 0.0778965 0.0283554 -0.0363453 0.0017618 0.0193084 -0.046629 -0.0357392 0.0969427 -0.0804851 -0.0749773 -0.0337344 -0.0269546 -0.0571525 -0.0753299 0.0002567 -0.0842665 0.0412283 0.0004716 0.000267 0.0004608 0.1674358 -0.0623963 0.0795058 -0.0003118 0.0787842 0.0561775 0.0003938 -0.0002869 0.000421 0.156949 unknown
polarizability: 164.1949064|1.6058236|122.0384807|-0.0605437|-0.273245|48.5911137 unknown
InChI: InChI=1S/C9H7NO3/c1-10-8(11)6-4-2-3-5-7(6)13-9(10)12/h2-5H,1H3
charge 0 multiplicity 1
20 atoms
O  -0.453137 -1.632544 0.003876
O  -0.818894 2.4981 -0.012631
O  -2.744979 -1.776517 0.007012
N  -1.797256 0.366253 -0.004826
C  0.64637 0.567667 -0.004371
C  0.716149 -0.844135 0.001074
C  -0.665968 1.246628 -0.007147
C  1.85127 1.315783 -0.006978
C  -1.744788 -1.041057 0.00153
C  1.948098 -1.52669 0.003869
C  -3.158525 0.958907 -0.007115
C  3.091071 0.652775 -0.004296
C  3.135551 -0.767503 0.001084
H  1.777123 2.407905 -0.011066
H  1.957264 -2.619899 0.008022
H  -3.039918 2.051268 -0.032549
H  -3.704276 0.652477 0.899925
H  -3.718056 0.609469 -0.88951
H  4.021819 1.228159 -0.006329
H  4.101583 -1.283146 0.003126
