program: Gaussian 09
title: 000020185
version: EM64L-G09RevD.01
frameworkgroup: C1[X(C26H24O3)]
method: RPBEPBE
basis: SDD
operation: Freq
keyword: #pfreq=noraman
keyword: PBEPBE/SDD
title: #p freq=noraman PBEPBE/SDD
converged: YES YES NO NO
title: Mulliken charges:
elementType: O O O C C C C C C C C C C C C C C C C C C C C C C C C C C H H H H H H H H H H H H H H H H H H H H H H H H
charge: -0.297971 -0.268125 -0.264329 -0.565937 -0.622225 0.165104 0.109814 -0.053863 0.404160 0.139359 -0.350050 0.259815 -0.309203 0.289197 -0.597145 -0.374723 -0.367101 -0.415603 0.328501 0.330364 -0.407846 -0.376244 -0.362386 -0.399164 -0.390755 -0.246802 -0.237091 -0.251929 -0.536584 0.234865 0.216995 0.230819 0.226873 0.250393 0.222110 0.228144 0.223862 0.215189 0.260531 0.256117 0.256155 0.256972 0.240289 0.248674 0.247275 0.238443 0.255983 0.222208 0.224000 0.226516 0.220842 0.221258 0.244251
chargesum: 0.00000
title: Mulliken charges with hydrogens summed into heavy atoms:
elementType: O O O C C C C C C C C C C C C C C C C C C C C C C C C C C
charge: -0.297971 -0.268125 -0.264329 -0.114077 -0.164533 0.165104 0.109814 0.196530 0.404160 0.139359 0.100204 0.259815 0.129848 0.289197 -0.336614 -0.118606 -0.110946 -0.158631 0.328501 0.330364 -0.167557 -0.127570 -0.115111 -0.160721 -0.134772 -0.024594 -0.013091 -0.025413 0.149767
polarizability: 3.71315208e+02 -3.38118236e+01 4.07411378e+02 2.31976802e+00 9.05193437e+00 1.85010320e+02
1716.lowfreq: -5.4488 -3.4007 -0.0008 0.0003 0.0005 3.5959 17.2831 29.3040 33.1186
frequency: 17.2590 29.3019 33.1109 39.1942 52.8875 55.6053 63.5231 77.1314 85.7467 93.5116 114.4368 140.6391 150.2454 164.4668 176.3466 196.0969 220.1005 225.3103 234.7516 247.7359 270.2650 306.4941 335.2794 345.4512 350.8252 370.9155 403.8509 406.2491 416.2149 441.7508 448.0000 470.2027 478.8514 510.2831 518.0750 540.4485 553.1827 566.7584 588.9718 615.2607 622.0714 633.7366 642.2736 679.4433 701.5711 712.8796 727.0605 741.3614 752.3791 768.4581 785.4972 794.2622 804.1497 813.9399 821.2308 838.5727 848.8954 856.3656 882.3451 891.5472 897.5084 915.4388 944.6489 951.9829 954.7528 965.9967 969.8785 973.3684 974.7824 985.3134 987.3998 991.4254 1004.2793 1009.8143 1024.8195 1028.2677 1039.9163 1054.0590 1083.2832 1097.4789 1111.8535 1112.1097 1113.8858 1124.7524 1139.6679 1144.2424 1152.8822 1171.2480 1174.9781 1178.6435 1190.0776 1192.2037 1209.3923 1211.5328 1221.6723 1238.1136 1238.4785 1271.5539 1278.8134 1299.0599 1301.2864 1310.6057 1321.3426 1345.2291 1350.9158 1360.5564 1371.4683 1377.3263 1413.6592 1416.0638 1430.8375 1432.6214 1445.2251 1449.9552 1461.5846 1465.6416 1472.4264 1474.0735 1481.3750 1482.6109 1487.2582 1496.0850 1559.0229 1570.5352 1576.0936 1593.6685 1606.4338 1616.3967 1623.0732 2947.0135 2958.7295 2960.2789 2963.7680 3026.1984 3042.8472 3046.3189 3052.3628 3071.0530 3116.7295 3119.4023 3123.7983 3127.3630 3132.0859 3140.4871 3142.4076 3142.8624 3145.6594 3154.2983 3161.0914 3165.2279 3166.1639 3167.6370 3181.0416
redmass: 6.1657 3.9390 4.7134 3.7601 5.2543 3.7512 4.4905 3.8395 3.9850 4.1633 3.5602 3.9357 3.8332 4.2984 5.4002 4.1495 1.9590 3.7546 2.3616 2.8370 3.6805 3.5700 4.7058 4.1444 5.3858 3.6685 2.7103 2.6734 2.8512 3.2846 4.5251 4.3916 3.7925 3.8974 3.4519 3.7491 4.0710 3.3469 6.1319 6.3312 4.8484 4.1368 5.8075 4.4991 1.7005 5.2819 4.1728 6.7332 4.0615 2.0073 3.1086 4.8129 4.3641 1.4866 1.3602 1.6312 1.2710 3.3361 2.4907 1.8998 1.1945 1.4456 1.4870 2.5920 1.5028 2.2649 1.6444 1.8666 1.5979 2.9784 5.5923 1.3419 2.7830 3.5073 2.3592 1.4362 2.1417 2.6018 1.6858 1.3573 1.3387 1.2603 1.3787 1.9370 1.5535 1.4218 1.1991 1.0754 1.5677 1.3845 1.7467 1.1201 1.4633 1.5312 2.6294 2.2134 1.4613 2.8575 1.5822 1.7225 1.5934 1.6024 1.8242 1.8059 1.5913 2.9287 5.8096 5.9783 2.7918 2.3540 1.5682 2.1939 2.0731 1.1477 1.1373 1.0511 1.2064 1.1065 1.8725 1.3236 2.6383 2.3639 6.9068 7.2866 5.9337 8.4529 6.0542 6.4750 6.8216 1.0689 1.0330 1.0640 1.0555 1.1069 1.0954 1.1039 1.0927 1.0532 1.0920 1.0845 1.0994 1.0875 1.0886 1.0933 1.0883 1.0875 1.0915 1.0958 1.0943 1.0953 1.0998 1.0967 1.1192
irintensity: 0.0057 0.6259 0.9252 0.2121 0.0022 0.9352 0.3874 2.6250 2.4555 4.3453 2.8958 2.8103 0.8587 2.4213 1.8928 5.5984 0.8511 0.9735 0.6677 3.6063 6.3667 1.8927 9.4503 0.8843 0.6719 0.4730 0.2256 1.3030 0.7642 2.7600 4.5214 6.4623 5.4212 2.5184 1.6975 5.6979 26.9715 20.2501 11.7182 0.4404 5.7081 4.4606 0.7197 1.5210 55.2632 4.6323 2.7280 1.9746 2.1094 61.0637 5.5453 19.0542 23.3560 41.3056 8.0999 44.5987 0.7784 5.2381 9.9788 19.8516 7.7294 4.5630 3.3494 12.6744 2.9069 14.4286 3.0997 3.5705 3.0877 82.5115 0.5643 0.9817 16.6236 69.2608 0.8777 0.3563 6.6354 4.5795 11.0043 4.3193 10.3002 0.1916 22.4991 41.4248 1.6014 14.4637 1.0533 2.2899 110.0288 88.7032 6.9244 0.3628 60.3837 3.9112 208.3447 136.8345 12.1739 84.2660 5.6338 18.1039 21.8597 4.7443 6.2648 4.9436 8.0129 14.2973 4.1414 8.0328 9.3597 1.0686 37.4986 12.6064 31.7298 18.1767 1.6795 13.2057 24.7026 48.3528 23.7963 14.3598 60.9909 109.9297 82.8960 20.2329 4.0582 6.5625 37.3729 75.9481 99.8321 27.8809 89.8376 33.2704 34.6962 26.8033 35.1956 48.1808 34.9988 23.7910 14.2112 6.1211 31.8451 1.3020 13.6098 29.2959 8.8014 11.1227 5.0815 42.0586 14.5690 19.7118 16.5008 3.9827 30.6677
temp: 298.150 k
press: 1.00000 atm
elementType: 8 8 8 6 6 6 6 6 6 6 6 6 6 6 6 6 6 6 6 6 6 6 6 6 6 6 6 6 6 1 1 1 1 1 1 1 1 1 1 1 1 1 1 1 1 1 1 1 1 1 1 1 1
symmnumber: 1
zpe: 1117614.4 jmol-1
zpe.correction: 0.425677 hartree
zpe.thermalcorrener: 0.451322 hartree
zpe.thermalcorrenthalpy: 0.452267 hartree
zpe.thermalcorrgfe: 0.367648 hartree
zpe.sumelectzpe: -1228.716446 hartree
zpe.sumelectthermal: -1228.690801 hartree
zpe.sumelectthermalent: -1228.689857 hartree
zpe.sumelectthermalfe: -1228.774475 hartree
dipole: 0.4696 -1.2492 1.2524
dipole: 1.8302
quadrupole: -173.7528 -148.6394 -168.7820
quadrupole: -7.4717 -5.9325 -3.9885
quadrupole: -10.0281 15.0853 -5.0573 -7.4717 -5.9325 -3.9885
hfenergy: -1229.142123 hartree
pointgroup: C01 [X(C26H24O3)]
dipole: 0.2622061 -0.4956202 0.4517667 debye
polarizability: 383.6147383|-37.980311|391.7851189|-1.4114618|27.6881393|188.3370488 unknown
InChI: InChI=1S/C26H24O3/c1-27-22-12-14-25-20(15-22)9-13-24(18-5-3-2-4-6-18)26(25)19-7-10-21(11-8-19)28-16-23-17-29-23/h2-8,10-12,14-15,23H,9,13,16-17H2,1H3
charge 0 multiplicity 1
53 atoms
O  -6.747703 -3.709952 -1.211996
O  -4.190427 -1.427379 0.322033
O  5.630283 -2.874264 -0.311403
C  2.87408 2.509316 0.319836
C  3.77187 1.686666 -0.626773
C  1.412554 2.057076 0.212914
C  1.15306 0.700418 0.089531
C  -6.154424 -2.577012 -0.407591
C  3.596899 0.203236 -0.354223
C  2.286431 -0.263005 -0.00186
C  -6.497648 -3.863136 0.273733
C  -0.237094 0.136754 0.118271
C  -4.725404 -2.246934 -0.776851
C  0.376815 3.127796 0.256795
C  4.669339 -0.696615 -0.449107
C  2.123178 -1.648134 0.260123
C  -1.110498 0.397065 1.211287
C  -0.716635 -0.692496 -0.927125
C  4.480156 -2.078227 -0.189615
C  -2.87444 -0.945495 0.186639
C  3.198841 -2.558195 0.172306
C  -2.411434 -0.133299 1.25088
C  -2.023946 -1.22892 -0.910307
C  0.54187 4.236591 1.137576
C  -0.760841 3.127598 -0.601618
C  -0.402801 5.284021 1.182657
C  -1.699063 4.179687 -0.565732
C  -1.530964 5.262134 0.330255
C  5.492572 -4.305091 -0.032011
H  2.957647 3.582944 0.076248
H  3.233439 2.381852 1.364184
H  4.830741 1.983006 -0.515234
H  3.480519 1.907176 -1.67575
H  -6.822675 -1.716779 -0.278035
H  -5.692146 -4.561097 0.533761
H  -7.403214 -3.921959 0.888394
H  -4.692417 -1.676988 -1.72788
H  -4.135402 -3.177828 -0.897688
H  5.672397 -0.349258 -0.718694
H  1.137369 -2.024632 0.550604
H  -0.75937 1.027427 2.034757
H  -0.06064 -0.915355 -1.776322
H  3.028746 -3.616517 0.390588
H  -3.082653 0.067613 2.091452
H  -2.356526 -1.856667 -1.742509
H  1.408876 4.268484 1.807766
H  -0.897966 2.302517 -1.307172
H  -0.257893 6.116863 1.880414
H  -2.561253 4.157831 -1.242148
H  -2.262812 6.077219 0.35792
H  4.780791 -4.78565 -0.731371
H  5.162979 -4.481714 1.010494
H  6.498236 -4.725388 -0.179604
