program: Gaussian 09
title: 000247242
version: EM64L-G09RevD.01
frameworkgroup: C1[X(C15H22N8O3S)]
method: RPBEPBE
basis: SDD
operation: Freq
keyword: #p
keyword: freq=noraman
keyword: PBEPBE/SDD
title: #p freq=noraman PBEPBE/SDD
converged: YES YES NO NO
title: Mulliken charges:
elementType: S O O O N N N N N N N N C C C C C C C C C C C C C C C H H H H H H H H H H H H H H H H H H H H H H
charge: 0.894360 -0.559833 -0.544171 -0.250481 -0.283805 -0.347415 -0.126974 -0.122615 -0.454098 -0.201001 -0.140294 -0.173425 -0.203213 -0.214487 -0.177886 0.498099 -0.432274 -0.341305 0.095422 0.182966 0.182515 -0.624130 -0.625183 -0.630539 -0.633793 0.224403 -0.778964 0.290522 0.282665 0.312913 0.228581 0.316238 0.348981 0.306366 0.283365 0.227718 0.222258 0.222915 0.223431 0.287312 0.226244 0.230820 0.278180 0.219647 0.229081 0.314050 0.214787 0.260024 0.262024
chargesum: 0.00000
title: Mulliken charges with hydrogens summed into heavy atoms:
elementType: S O O O N N N N N N N N C C C C C C C C C C C C C C C
charge: 0.894360 -0.559833 -0.544171 -0.250481 0.029109 0.001566 -0.126974 -0.122615 -0.147732 -0.201001 -0.140294 -0.173425 -0.203213 0.076035 0.104779 0.498099 -0.203694 -0.025067 0.095422 0.182966 0.182515 0.109211 0.108475 0.104706 0.128985 0.224403 -0.042129
polarizability: 2.95977246e+02 2.05480751e+01 3.48505699e+02 -2.80229573e+01 4.86471146e-01 2.36910787e+02
1716.lowfreq: -6.3190 -0.8102 -0.0018 0.0006 0.0011 4.7153 11.3124 13.8211 30.0749
frequency: 10.6111 13.6233 29.9905 38.0739 41.2223 61.0985 68.8719 77.6247 80.5820 83.3308 90.3006 102.1497 109.7102 118.0064 124.9938 127.8288 135.7550 147.8632 154.5271 165.8206 171.0413 182.5236 191.0907 207.5582 222.1445 260.4791 278.6614 290.0176 299.2517 308.2995 331.2454 333.1122 352.5591 372.9830 384.8365 403.6037 412.2653 425.9695 470.4853 486.7539 529.6070 531.3814 544.3625 546.7722 581.4329 597.7261 619.8850 651.6328 654.9511 672.6067 689.0026 700.7965 710.6818 731.0838 780.2666 785.1637 822.3653 828.3537 836.3339 868.1382 884.7607 894.6489 915.0116 931.2969 964.2668 980.4679 987.8233 994.8207 1000.7836 1018.3052 1040.2470 1046.2003 1051.6500 1055.7268 1058.6591 1098.1547 1098.6429 1116.9547 1146.1776 1150.8561 1155.5621 1181.7268 1198.1091 1203.0486 1214.3756 1252.3691 1256.4100 1262.5246 1292.7867 1295.8397 1338.2386 1368.2986 1371.6975 1391.2044 1403.8420 1410.2122 1412.0253 1417.4313 1424.0599 1435.8319 1448.9081 1449.0386 1465.4398 1468.7314 1468.9170 1471.5412 1473.5680 1476.2429 1479.4117 1483.7555 1492.0703 1498.0078 1501.6732 1536.8017 1568.3144 1594.3295 1598.7831 1603.4104 1628.9206 2964.6631 2968.8699 2970.1979 2974.3692 2996.4820 3037.5837 3040.1531 3044.0434 3057.3270 3094.6224 3104.0106 3114.6834 3118.8139 3132.2248 3133.6461 3135.0136 3155.3081 3157.7081 3189.6668 3197.2034 3532.8792 3553.2423
redmass: 5.1791 5.1165 4.7743 6.5670 5.0747 1.2410 2.6856 3.4191 2.7184 2.9979 5.6127 1.7530 2.7498 1.5990 2.0585 1.3700 1.6128 5.0778 2.6876 2.4812 6.5784 3.8905 5.4525 7.2342 8.1886 3.1921 3.9824 3.7111 6.5192 5.3868 6.1591 3.0056 3.3053 5.0654 4.4740 5.6637 2.9828 4.4051 4.4776 4.7704 4.1164 3.4363 4.5197 4.6884 5.6818 3.1475 6.9575 1.1952 1.4795 5.8673 5.6864 9.4034 4.9373 3.2886 12.2279 16.9001 4.6415 5.7282 1.4540 1.4615 5.1475 10.4215 5.2117 6.1607 1.3633 1.5020 3.8769 1.7475 1.3382 2.7266 1.6362 2.1293 2.3780 1.4751 1.4070 1.2186 1.2180 1.3099 1.4336 1.3724 2.9879 1.1568 3.2070 3.1077 3.4742 5.3411 3.7339 1.8645 1.4368 6.3124 5.0784 2.8149 2.4873 1.2358 4.6315 1.2298 1.3788 1.2519 1.8209 2.0200 1.4180 1.0643 1.0481 1.0694 1.2057 1.1998 1.9222 1.2128 1.0504 1.0541 1.0463 1.0847 2.1864 2.2664 3.2355 6.8654 5.6592 4.4470 4.8121 1.0370 1.0368 1.0374 1.0377 1.0365 1.1012 1.1016 1.1015 1.0984 1.0994 1.0991 1.1007 1.0899 1.0965 1.0960 1.0958 1.0907 1.0948 1.0724 1.0948 1.0766 1.0787
irintensity: 0.6184 0.0815 5.1868 1.9067 1.2687 1.3247 2.0083 1.6817 3.6546 0.8377 1.7058 0.3874 1.2191 0.3748 0.9855 3.9287 7.6093 11.4494 3.9006 6.7934 3.9666 2.3443 5.7265 5.2819 28.0838 0.0522 0.1162 7.0250 10.1106 2.1741 17.2118 1.9313 5.3285 0.2160 4.2763 17.0503 0.2117 5.1998 34.8217 20.5081 34.3841 19.5372 10.3364 75.0431 11.4435 1.9768 2.0004 41.0532 51.9131 6.6377 12.5327 3.3581 17.1456 1.0353 28.6098 126.8920 5.5539 15.9592 28.7380 39.4508 39.9214 3.3789 6.0472 5.0190 6.6662 169.7446 0.9909 13.1153 2.2332 39.8203 13.2052 76.7815 31.1541 5.0998 6.5596 1.5138 0.6363 10.8385 10.5138 1.5682 251.2267 18.8459 60.4912 142.5204 48.0780 7.1918 4.7658 53.6514 33.6406 50.1227 115.0421 172.7861 395.6212 49.8328 4.2744 89.8357 202.0052 8.5154 345.6885 240.9542 1.9587 20.8403 24.5466 8.3601 13.6257 157.2110 14.0237 44.1408 3.3105 2.9075 26.8909 73.0587 351.2126 34.3227 1061.9628 79.3931 43.2723 169.6392 106.7255 27.4481 13.6720 221.3651 134.3703 11.9433 55.3617 9.8918 38.1807 22.4357 13.2533 10.1311 0.5720 17.9109 1.7439 1.5397 2.3525 0.9295 9.6248 53.4724 5.6476 14.4393 55.7504
temp: 298.150 k
press: 1.00000 atm
elementType: 16 8 8 8 7 7 7 7 7 7 7 7 6 6 6 6 6 6 6 6 6 6 6 6 6 6 6 1 1 1 1 1 1 1 1 1 1 1 1 1 1 1 1 1 1 1 1 1 1
symmnumber: 1
zpe: 992607.6 jmol-1
zpe.correction: 0.378064 hartree
zpe.thermalcorrener: 0.407831 hartree
zpe.thermalcorrenthalpy: 0.408775 hartree
zpe.thermalcorrgfe: 0.313789 hartree
zpe.sumelectzpe: -1644.368789 hartree
zpe.sumelectthermal: -1644.339022 hartree
zpe.sumelectthermalent: -1644.338078 hartree
zpe.sumelectthermalfe: -1644.433064 hartree
dipole: 3.9502 8.9441 -2.3509
dipole: 10.0562
quadrupole: -125.5588 -193.6793 -161.7224
quadrupole: -11.4135 -16.5636 -2.9152
quadrupole: 34.7613 -33.3591 -1.4022 -11.4135 -16.5636 -2.9152
hfenergy: -1644.7468532 hartree
pointgroup: C01 [X(C15H22N8O3S1)]
dipole: 0.823052 3.1134462 2.2983411 debye
polarizability: 249.4048195|30.8923551|333.2810589|-21.5583538|33.5957983|298.7078525 unknown
InChI: InChI=1S/C8H8NO3S.C7H14N7/c1-6(10)9-7-2-4-8(5-3-7)13(11)12;1-13(2)6-9-5(12-8)10-7(11-6)14(3)4/h2-5,9H,1H3;8,12H,1-4H3
charge 0 multiplicity 1
49 atoms
S  -0.793684 -3.208648 -0.957141
O  -1.0602 -2.726617 -2.512799
O  -1.455065 -4.603329 -0.404714
O  -2.953115 3.074852 1.505348
N  1.441839 -3.155307 -0.496446
N  1.767493 -2.066477 0.255441
N  2.861222 2.481221 0.854574
N  1.505153 0.871369 -3.377038
N  -3.164544 1.068163 2.709297
N  1.689308 -0.637186 -1.582603
N  2.307655 0.196258 0.627483
N  2.210191 1.719212 -1.281915
C  -1.482049 -1.847897 0.170561
C  -1.952608 -2.222171 1.441871
C  -1.551003 -0.526804 -0.300205
C  -2.583093 0.123141 1.819562
C  -2.507194 -1.226452 2.266821
C  -2.105542 0.472754 0.525658
C  1.927671 -0.756576 -0.256039
C  2.453636 1.449536 0.042022
C  1.814518 0.657336 -2.059127
C  3.020767 3.847888 0.338965
C  3.129071 2.279152 2.285413
C  1.682269 2.190411 -4.001317
C  1.004486 -0.219909 -4.236316
C  -3.334601 2.447013 2.535325
C  -4.03613 3.150531 3.695033
H  -1.916565 -3.271793 1.751672
H  -1.202863 -0.287091 -1.310226
H  1.615668 -2.862214 -1.493925
H  -2.890017 -1.497969 3.258909
H  -2.176698 1.508499 0.190434
H  1.83162 -2.196594 1.267674
H  -3.508911 0.681698 3.591003
H  2.795118 3.850279 -0.735896
H  2.329618 4.53809 0.860541
H  4.057806 4.200002 0.50097
H  4.174136 2.557649 2.522474
H  2.452254 2.909265 2.894709
H  2.966735 1.221709 2.534181
H  2.365783 2.112718 -4.868475
H  0.710146 2.583031 -4.356004
H  2.103685 2.882431 -3.259409
H  0.218646 0.182342 -4.900653
H  1.817099 -0.636278 -4.863328
H  0.577175 -1.027537 -3.623154
H  -4.230646 2.500927 4.566099
H  -3.420633 4.006799 4.018311
H  -4.997907 3.557871 3.336979
