program: Gaussian 09
title: 000247145
version: EM64L-G09RevD.01
frameworkgroup: C1[X(C6H16N4)]
method: RPBEPBE
basis: SDD
operation: Freq
keyword: #pfreq=noraman
keyword: PBEPBE/SDD
title: #p freq=noraman PBEPBE/SDD
converged: YES YES NO NO
title: Mulliken charges:
elementType: N N N N C C C C C C H H H H H H H H H H H H H H H H
charge: -0.085170 -0.111400 -0.634802 -0.657063 -0.330445 -0.401000 -0.448600 -0.616009 -0.622093 0.208363 0.211384 0.187117 0.200318 0.212202 0.210569 0.176272 0.222236 0.183162 0.216865 0.213716 0.184608 0.231204 0.316861 0.290370 0.307781 0.333554
chargesum: 0.00000
title: Mulliken charges with hydrogens summed into heavy atoms:
elementType: N N N N C C C C C C
charge: -0.085170 -0.111400 -0.027571 -0.015728 0.068056 0.011519 -0.061759 0.006255 0.007435 0.208363
polarizability: 1.22769912e+02 -4.95816987e+00 9.00725609e+01 -6.82624027e+00 -1.63560005e+00 7.84040225e+01
1716.lowfreq: -10.1640 -4.7879 0.0004 0.0007 0.0008 5.6546 24.6150 38.1090 56.3015
frequency: 24.1927 37.2252 56.2811 116.4338 168.7983 181.5252 227.0812 236.6988 255.4675 262.2293 338.4807 361.5509 395.5647 406.2231 415.6790 424.0333 463.3672 499.4464 556.5989 575.1065 675.7097 770.6931 805.1549 856.6885 902.3206 962.8234 1029.6726 1031.7565 1033.2719 1034.3673 1072.8100 1089.7869 1099.9774 1138.4476 1160.2297 1182.7741 1229.1594 1240.2814 1261.0381 1296.7527 1326.3453 1348.2725 1375.2578 1405.1653 1417.2159 1439.8344 1452.8905 1456.3898 1460.9796 1467.6161 1476.4406 1479.5795 1486.7927 1600.2818 1613.0409 1670.2948 2835.5833 2849.3326 2858.8497 2876.6273 2923.5513 2993.0962 2997.9246 3011.3604 3026.1874 3061.4693 3070.9004 3086.7594 3518.8022 3547.2971 3667.0408 3693.1011
redmass: 4.0001 2.7913 3.2970 2.1456 3.1031 3.2135 1.7811 1.2731 1.3157 1.8728 2.3265 1.2690 1.3024 2.4449 1.7286 1.1730 2.0747 2.7652 1.9725 1.7306 4.8499 1.4214 3.3351 2.7920 1.8615 2.8300 1.8727 1.4616 1.8700 1.9311 1.8243 1.4387 1.9734 1.5071 1.5365 2.1296 1.2916 1.7726 2.4938 1.1684 1.3519 1.3846 1.4574 4.3189 1.1449 1.1647 1.0819 1.0896 1.0521 1.0584 1.0547 1.0767 1.0624 1.2221 1.2805 3.6101 1.0576 1.0585 1.0616 1.0666 1.0944 1.0891 1.0610 1.0711 1.0720 1.1031 1.1008 1.0993 1.0450 1.0453 1.1014 1.1026
irintensity: 4.9321 0.6166 1.9050 0.4319 4.9719 1.9783 2.6904 4.0891 1.2161 2.9703 9.1469 77.9675 145.9762 5.7930 46.9046 157.3517 15.8391 5.3163 132.9895 111.3053 85.9267 0.6248 10.9843 9.1685 1.0358 9.9836 34.4044 9.6332 6.3929 26.6118 1.9404 9.9008 11.4185 0.9181 8.4675 3.4468 7.1791 5.7464 7.1812 2.3754 1.0249 56.5136 1.6167 124.8001 2.3578 1.0066 14.8258 18.9903 20.9619 2.9726 11.5953 13.6202 24.4768 135.8807 78.0040 523.7560 78.2281 144.7589 89.5944 108.0535 59.1715 24.2316 52.3419 51.3302 56.7520 44.1637 49.3040 43.6727 17.0396 15.6899 18.1122 18.6558
temp: 298.150 k
press: 1.00000 atm
elementType: 7 7 7 7 6 6 6 6 6 6 1 1 1 1 1 1 1 1 1 1 1 1 1 1 1 1
symmnumber: 1
zpe: 600345.8 jmol-1
zpe.correction: 0.228660 hartree
zpe.thermalcorrener: 0.241566 hartree
zpe.thermalcorrenthalpy: 0.242511 hartree
zpe.thermalcorrgfe: 0.188604 hartree
zpe.sumelectzpe: -456.377915 hartree
zpe.sumelectthermal: -456.365009 hartree
zpe.sumelectthermalent: -456.364064 hartree
zpe.sumelectthermalfe: -456.417971 hartree
dipole: -3.3377 0.2170 1.1809
dipole: 3.5471
quadrupole: -48.6715 -59.5641 -62.6567
quadrupole: 2.4480 -3.7296 -3.1058
quadrupole: 8.2926 -2.6000 -5.6926 2.4480 -3.7296 -3.1058
hfenergy: -456.606575 hartree
pointgroup: C01 [X(C6H16N4)]
dipole: -1.301941 -0.1116278 -0.4899655 debye
dipolederiv: -0.6670779 0.0537853 0.0158775 0.0144387 -0.587586 0.0061242 0.0259834 0.0087894 -0.5072403 -1.3432888 -0.4231537 -0.1285019 -0.2469135 -0.5442629 0.0261046 -0.24284 -0.067426 -0.4905657 -0.5372258 -0.3686397 0.0297739 -0.5714784 -1.0899991 -0.0359193 -0.0335916 -0.1379948 -0.6293147 -1.0350994 0.3042789 -0.0737741 0.4158069 -0.5172057 0.23925 -0.1444901 0.14065 -0.7029844 0.5634256 0.0243724 0.0401171 0.0066569 0.2920916 -0.0769571 0.0178108 -0.1043264 0.1345004 -0.0561399 0.0661974 -0.0029522 0.073725 0.0972007 -0.0539565 0.0130031 -0.029122 0.1095175 0.521306 0.1825635 -0.0396587 0.2663924 0.3848379 0.048197 -0.0941887 0.0271529 0.313179 0.2105116 -0.0090157 -0.1224251 -0.0431101 0.4476848 0.1065279 -0.1921606 0.1159309 0.2355258 0.1068524 0.0873737 0.057236 0.0646048 0.338085 -0.1286091 0.0922773 -0.1325435 0.3615789 1.6530323 0.4733495 0.397769 0.3628885 1.1401859 -0.4115071 0.6052025 -0.3774726 0.6831908 -0.0650993 -0.0328093 -0.0151559 -0.1848633 -0.1708591 0.0077077 0.026394 0.0571234 0.0460769 0.0213908 0.0123662 -0.0244475 -0.0023351 0.0540043 0.0349269 -0.0439737 0.0221898 -0.1947561 -0.0092055 -0.1140005 0.0145342 -0.0871767 -0.1408051 0.0230399 0.0406125 0.0527426 0.0669158 0.0902145 -0.0008577 -0.0152074 0.043041 0.0626136 0.0354414 -0.0374484 -0.0097448 -0.1625198 -0.083627 0.0904737 0.0507334 -0.0346599 -0.2263205 -0.0712699 0.0717619 -0.0883112 0.0306304 -0.0295001 -0.0469247 -0.0305512 -0.1020034 -0.0263227 0.0288924 0.0550283 0.1291968 -0.2403929 0.1169632 0.0154876 -0.070961 0.0199172 0.0400723 0.0778351 0.0028505 0.046692 -0.1749003 0.0250219 -0.1230967 0.0227873 0.0443425 -0.3206697 -0.111295 0.0638565 0.0211453 0.0169146 -0.2258202 0.0256574 -0.0055574 0.0125649 0.0634234 -0.0323215 -0.07598 -0.0074922 0.092115 -0.2171867 0.0079402 -0.0941203 0.0196761 0.0826723 0.0404059 -0.0181159 0.0134911 0.075693 0.0380106 -0.1315197 0.0481375 -0.0527781 -0.2265919 0.1954745 -0.0349013 0.0380757 -0.0577889 0.1043935 0.0616301 0.1202735 0.0581923 -0.0311158 -0.1072933 0.0837154 -0.0878848 -0.0489391 0.1734638 0.0165252 -0.0581603 0.0177335 0.2825938 0.0628573 -0.0433799 0.1199447 0.2537157 0.073607 -0.0012788 0.0174674 0.07706 0.2508663 0.0588272 0.1279121 0.1615398 0.3153211 0.278604 -0.0647281 -0.0888479 -0.0745159 0.1786647 -0.0045898 -0.2053222 0.0342156 0.2243175 0.2924734 -0.1059766 -0.0443858 -0.0972061 0.1667416 0.0421067 -0.060016 0.0534382 0.2502097 unknown
polarizability: 122.7142596|4.8729011|88.8240192|7.302507|-3.4915175|79.7082163 unknown
InChI: InChI=1S/C6H16N4/c1-10(2)5-3-4-9-6(7)8/h3-5,7-8H2,1-2H3
charge 0 multiplicity 1
26 atoms
N  2.851903 -0.019986 -0.043434
N  -1.531889 0.069612 0.470931
N  -3.341315 -1.426149 0.326737
N  -3.501722 0.593793 -0.859732
C  1.39571 0.039848 -0.340131
C  0.671163 1.190945 0.382156
C  -0.81813 1.270376 -0.014118
C  3.56388 -0.898046 -0.9943
C  3.140001 -0.401994 1.354733
C  -2.72401 -0.206041 -0.002734
H  0.878386 -0.920443 -0.090773
H  1.289949 0.1919 -1.433598
H  1.179801 2.143433 0.136326
H  0.717945 1.05429 1.478391
H  -1.24816 2.193683 0.438506
H  -0.891842 1.390336 -1.124698
H  3.397633 -0.541378 -2.026947
H  3.238437 -1.970069 -0.943936
H  4.650085 -0.864369 -0.791507
H  4.233101 -0.404349 1.517455
H  2.745561 -1.41695 1.621648
H  2.696614 0.328499 2.051687
H  -2.771407 -2.040852 0.906578
H  -4.349844 -1.445476 0.475756
H  -4.200976 0.166548 -1.463378
H  -3.177782 1.528139 -1.092517
