program: Gaussian 09
title: 000247155
version: EM64L-G09RevD.01
frameworkgroup: C1[X(C10H18Br2N2O2)]
method: RPBEPBE
basis: SDD
operation: Freq
keyword: #p
keyword: freq=noraman
keyword: PBEPBE/SDD
title: #p freq=noraman PBEPBE/SDD
converged: YES YES NO NO
title: Mulliken charges:
elementType: Br Br O O N N C C C C C C C C C C H H H H H H H H H H H H H H H H H H
charge: -0.060112 -0.035362 -0.267649 -0.275097 -0.356008 -0.373989 -0.026475 -0.412501 -0.387750 -0.709242 0.265289 0.249026 -0.512071 -0.480216 -0.635039 -0.650232 0.249439 0.252562 0.215525 0.233183 0.243610 0.231921 0.220736 0.209775 0.309015 0.310065 0.239968 0.255070 0.233072 0.265327 0.314020 0.287166 0.282132 0.314842
chargesum: 0.00000
title: Mulliken charges with hydrogens summed into heavy atoms:
elementType: Br Br O O N N C C C C C C C C C C
charge: -0.060112 -0.035362 -0.267649 -0.275097 -0.046993 -0.063924 0.222964 0.055585 0.089043 -0.046811 0.265289 0.249026 -0.017033 0.018183 -0.033853 -0.053257
polarizability: 2.05223231e+02 -1.23835226e+01 1.43722092e+02 -1.83267605e+00 -7.85642068e+00 1.22170992e+02
1716.lowfreq: -6.0555 0.0003 0.0004 0.0004 3.2313 5.0710 11.4985 18.0970 21.3831
frequency: 10.7752 18.0089 21.2748 28.2160 35.7524 45.8717 63.8475 69.6098 84.4326 90.1251 157.0327 163.7990 190.3358 198.8795 213.2115 262.8864 269.8546 299.7465 319.5739 342.1275 385.5904 399.9088 472.3891 503.5392 516.2159 552.1730 572.3696 585.6490 608.0040 629.2199 676.4631 717.8014 772.6728 799.9133 831.4052 861.6763 887.1729 916.7023 940.4110 944.4292 957.5334 963.2183 1009.1249 1035.4974 1077.1886 1081.9737 1110.4556 1124.8566 1128.6428 1139.3974 1155.9350 1171.4031 1209.9463 1228.3492 1238.9824 1251.8512 1266.2453 1273.1284 1284.7019 1314.6687 1326.3194 1336.0342 1344.2852 1357.8126 1366.5344 1390.7914 1432.1269 1433.5485 1445.3593 1447.9280 1453.5765 1458.0771 1472.3166 1477.0849 1491.5261 1496.9107 1611.7832 1620.2415 2977.9668 2985.9053 2989.7257 2993.9583 3004.5020 3006.2080 3056.0880 3061.8196 3063.9796 3067.9008 3068.2992 3071.3148 3074.9112 3084.1803 3157.0908 3161.6364 3539.8149 3559.9408
redmass: 12.6936 3.8965 3.8282 10.0621 6.0339 4.8679 3.1097 4.2395 5.7198 4.6993 4.7860 5.0162 1.2585 2.2159 5.8516 3.0396 2.9530 2.7981 3.0084 3.7240 2.2609 2.9387 2.8071 2.5795 4.0479 1.4426 2.1718 4.0215 1.5652 3.4934 2.9429 3.5367 1.2835 2.2024 2.6614 2.4865 2.0045 1.8865 1.8839 1.6242 1.5242 1.8302 3.1285 4.3297 2.2453 2.4721 1.6787 1.4166 1.9675 2.1927 1.9334 1.3371 1.4655 1.2318 1.4919 1.5582 1.2092 1.2171 1.2118 1.1950 1.4214 1.3244 1.5306 1.3547 1.4025 1.2111 1.1028 1.1173 1.1359 1.0877 1.1020 1.1145 1.0865 1.0602 1.8010 1.7990 6.2485 6.3053 1.0367 1.0613 1.0615 1.0774 1.0596 1.0645 1.0920 1.1016 1.0974 1.1026 1.0637 1.0621 1.1007 1.0989 1.1120 1.1106 1.0777 1.0785
irintensity: 0.2971 1.0277 3.6868 1.1073 6.2977 2.0414 3.8273 2.0727 4.9292 6.9371 8.4867 2.6802 1.6186 4.3269 0.4380 3.8502 17.3285 4.3920 16.3238 2.0498 5.7323 8.8864 10.6891 51.7117 4.2597 64.0579 57.0834 59.3635 51.4296 0.8558 1.4382 11.2019 12.8674 7.0664 4.6164 0.9040 8.0599 44.4130 0.8485 4.2912 4.0622 6.3098 3.2575 2.6097 8.8353 5.3493 4.8691 1.1898 1.4958 16.4237 21.9293 19.7338 41.4899 17.8271 59.7196 15.9894 42.9451 18.6299 0.9124 8.4740 65.3807 28.9149 17.6990 2.0866 8.1618 17.3040 22.3382 27.1219 15.2111 8.4194 19.9291 58.9707 2.5257 32.8336 260.7378 123.9863 217.7042 115.1885 25.4661 9.8315 30.5748 2.5074 10.9036 42.6617 11.2619 7.2399 11.8769 1.7213 19.4668 10.1031 43.6740 32.8865 2.7235 4.4048 20.5443 19.4291
temp: 298.150 k
press: 1.00000 atm
elementType: 35 35 8 8 7 7 6 6 6 6 6 6 6 6 6 6 1 1 1 1 1 1 1 1 1 1 1 1 1 1 1 1 1 1
symmnumber: 1
zpe: 725951.8 jmol-1
zpe.correction: 0.276500 hartree
zpe.thermalcorrener: 0.296238 hartree
zpe.thermalcorrenthalpy: 0.297182 hartree
zpe.thermalcorrgfe: 0.220594 hartree
zpe.sumelectzpe: -677.495253 hartree
zpe.sumelectthermal: -677.475516 hartree
zpe.sumelectthermalent: -677.474572 hartree
zpe.sumelectthermalfe: -677.551159 hartree
dipole: -5.9625 -0.3058 -1.5874
dipole: 6.1777
quadrupole: -120.1590 -120.6547 -119.4842
quadrupole: 0.6297 14.2696 -1.0802
quadrupole: -0.0597 -0.5554 0.6151 0.6297 14.2696 -1.0802
hfenergy: -677.7717533 hartree
pointgroup: C01 [X(C10H18Br2N2O2)]
dipole: 1.8917318 0.9336539 -1.207079 debye
polarizability: 198.796387|17.5408008|149.9052587|-15.6482281|-5.1574292|122.4146692 unknown
InChI: InChI=1S/C10H18Br2N2O2/c1-8(6-13-9(15)2-4-11)7-14-10(16)3-5-12/h8,13-14H,2-7H2,1H3
charge 0 multiplicity 1
34 atoms
Br 0.045185 3.084165 -1.749522
Br -6.256657 -1.699053 1.359462
O  3.096843 1.849963 0.539682
O  -1.878111 -3.040339 -0.166156
N  2.820191 0.331452 -1.201015
N  -1.12632 -0.848113 0.096497
C  1.365833 -0.928038 0.450028
C  2.718743 -0.841916 -0.309105
C  0.182744 -1.058542 -0.544046
C  1.399682 -2.096546 1.457149
C  2.975382 1.607554 -0.701352
C  -2.061998 -1.854491 0.251457
C  2.984159 2.743475 -1.735824
C  -3.351496 -1.44217 0.987016
C  1.926831 3.797636 -1.399237
C  -4.564212 -2.085405 0.305391
H  1.255622 0.023523 1.007354
H  3.532693 -0.778508 0.435458
H  2.877942 -1.751445 -0.918777
H  0.296164 -0.316792 -1.358077
H  0.156126 -2.07177 -0.985124
H  0.432797 -2.191232 1.981736
H  2.185765 -1.943482 2.219184
H  1.592559 -3.058976 0.945871
H  2.684127 0.206791 -2.204799
H  -1.342887 0.090093 0.440095
H  2.863588 2.38378 -2.773323
H  3.973423 3.240488 -1.665309
H  -3.466516 -0.343943 1.029802
H  -3.283275 -1.808514 2.028691
H  1.939788 4.050948 -0.328853
H  1.996598 4.693965 -2.031932
H  -4.755841 -1.679684 -0.698851
H  -4.475072 -3.179471 0.269033
