program: Gaussian 09
title: 000247140
version: EM64L-G09RevD.01
frameworkgroup: C1[X(C17H16N2)]
method: RPBEPBE
basis: SDD
operation: Freq
keyword: #pfreq=noraman
keyword: PBEPBE/SDD
title: #p freq=noraman PBEPBE/SDD
converged: YES YES NO NO
title: Mulliken charges:
elementType: N N C C C C C C C C C C C C C C C C C H H H H H H H H H H H H H H H H
charge: -0.073811 -0.073821 0.034677 -0.042978 -0.042935 -0.672047 -0.672045 0.338301 0.338269 -0.378770 -0.378783 -0.377649 -0.377643 -0.236251 -0.236228 -0.235850 -0.235849 -0.239567 -0.239566 0.227423 0.230679 0.224916 0.227423 0.230679 0.224920 0.262864 0.262852 0.263670 0.263666 0.231171 0.231169 0.229624 0.229624 0.230932 0.230932
chargesum: 0.00000
title: Mulliken charges with hydrogens summed into heavy atoms:
elementType: N N C C C C C C C C C C C C C C C C C
charge: -0.073811 -0.073821 0.034677 -0.042978 -0.042935 0.010971 0.010976 0.338301 0.338269 -0.115906 -0.115931 -0.113979 -0.113976 -0.005080 -0.005059 -0.006226 -0.006224 -0.008635 -0.008634
polarizability: 2.22964020e+02 -4.71028695e-03 2.52522980e+02 2.07441076e+01 2.12573445e-03 1.20640606e+02
1716.lowfreq: -9.6347 -0.0003 0.0001 0.0005 2.9260 8.5556 41.7967 47.7243 66.5226
frequency: 41.7572 47.7196 66.5222 69.0158 99.0793 121.5781 162.0847 192.6150 206.4982 234.2400 248.5414 250.2743 276.8973 358.0944 360.8721 397.0228 403.5554 409.5751 411.1590 496.7270 538.0496 574.1819 579.7709 614.4051 617.1450 636.5416 660.0613 700.5644 701.9478 709.1104 742.6275 771.5070 798.4597 832.1434 845.4271 854.5945 860.1119 932.7733 936.0090 941.4133 952.5932 964.8725 982.0244 984.7627 989.4209 989.8639 999.0310 999.8740 1002.4265 1015.7809 1031.4442 1049.9696 1084.1607 1089.3642 1151.1753 1165.9439 1173.8551 1173.9170 1190.8451 1192.6594 1203.6339 1266.7690 1281.8911 1318.5950 1325.6951 1364.4063 1378.6375 1379.8853 1383.4659 1433.1206 1436.1694 1451.0754 1457.0962 1459.5338 1467.6899 1478.5026 1481.4672 1515.7267 1546.3121 1584.6199 1589.0303 1613.6504 1614.1725 3002.1510 3004.0986 3105.3997 3108.9694 3114.1478 3119.6475 3128.5641 3128.6413 3139.0291 3139.3474 3152.3031 3152.8660 3161.7633 3162.1986 3171.1499 3171.4766
redmass: 3.6967 4.6394 3.9672 3.7148 3.6882 3.9856 4.2455 1.0584 3.7392 1.4835 1.9548 4.6588 2.9717 4.9629 4.1250 3.5055 2.8702 3.6407 3.3847 3.5812 4.5321 5.6033 4.1517 6.3965 6.5042 4.9152 6.6989 1.7435 2.9804 2.2954 3.1061 1.8830 3.3618 8.8461 3.1975 1.2516 1.2494 1.4306 1.4267 1.4242 6.9151 1.9859 1.4007 1.4248 5.4096 6.0533 1.3257 1.3244 1.3011 4.0944 2.0246 2.2876 1.5903 1.6838 2.2622 4.5147 1.0548 1.0630 1.1144 1.1448 2.8072 4.2447 3.9647 1.3575 1.4334 1.1864 7.3583 6.8000 1.2370 2.2945 2.3208 1.0509 1.0469 2.5381 1.1171 1.0886 2.1888 5.0976 8.9984 6.0180 6.4709 6.0677 6.0628 1.0335 1.0342 1.1010 1.1004 1.1017 1.1011 1.0849 1.0849 1.0885 1.0885 1.0931 1.0929 1.0962 1.0958 1.1010 1.1009
irintensity: 0.0283 0.2588 0.0676 1.7139 0.0431 0.1709 0.4467 0.0001 0.0000 0.3193 0.1115 0.1595 0.6023 0.1119 1.2100 2.2648 0.1952 0.0179 0.2454 0.7509 4.2426 11.0438 42.2579 0.3226 0.4160 0.5009 4.8373 94.2625 17.3884 0.1672 22.6290 74.0146 13.8840 0.2567 16.0796 3.5825 1.1991 4.9636 1.0673 1.5139 23.3706 3.5542 3.3006 0.5391 0.2186 0.9566 0.4192 0.0126 0.0293 12.3684 4.0839 0.0041 11.4546 4.4433 48.2932 9.6418 0.2432 0.0927 5.7653 3.8211 31.3691 46.4978 5.4721 3.7852 1.5048 13.9702 1.0700 1.1137 2.9785 23.8022 0.0481 11.9087 0.1244 37.1908 16.1577 21.0142 5.0961 20.9890 11.2338 0.1633 1.6526 5.0206 0.4939 21.6139 32.5076 12.5942 39.9285 0.7317 30.5075 0.4078 0.0005 8.4632 4.9403 34.3052 17.5175 33.5988 8.0838 13.3160 17.1456
temp: 298.150 k
press: 1.00000 atm
elementType: 7 7 6 6 6 6 6 6 6 6 6 6 6 6 6 6 6 6 6 1 1 1 1 1 1 1 1 1 1 1 1 1 1 1 1
symmnumber: 1
zpe: 740952.3 jmol-1
zpe.correction: 0.282214 hartree
zpe.thermalcorrener: 0.298483 hartree
zpe.thermalcorrenthalpy: 0.299427 hartree
zpe.thermalcorrgfe: 0.238015 hartree
zpe.sumelectzpe: -765.574405 hartree
zpe.sumelectthermal: -765.558135 hartree
zpe.sumelectthermalent: -765.557191 hartree
zpe.sumelectthermalfe: -765.618604 hartree
dipole: 0.0001 -1.7975 0.0003
dipole: 1.7975
quadrupole: -105.0390 -99.3036 -110.8664
quadrupole: -0.0012 5.4797 0.0010
quadrupole: 0.0306 5.7661 -5.7967 -0.0012 5.4797 0.0010
hfenergy: -765.8566184 hartree
pointgroup: C01 [X(C17H16N2)]
dipole: -0.0011432 0.7072097 0.0001183 debye
polarizability: 213.2150789|-0.0663875|252.5228685|-36.5079026|-0.0579542|130.389658 unknown
InChI: InChI=1S/C17H16N2/c1-17(2)18-15(13-9-5-3-6-10-13)16(19-17)14-11-7-4-8-12-14/h3-12H,1-2H3
charge 0 multiplicity 1
35 atoms
N  1.1898 -2.068281 -0.227051
N  -1.183091 -2.072098 0.226603
C  0.004785 -2.954859 -0.00017
C  0.751289 -0.820072 -0.132721
C  -0.748622 -0.82249 0.132166
C  -0.246363 -3.823132 -1.256597
C  0.258717 -3.822066 1.256446
C  1.682307 0.330604 -0.227302
C  -1.683388 0.325139 0.226855
C  1.505905 1.504042 0.554856
C  -1.511157 1.499109 -0.555437
C  2.824539 0.228672 -1.067387
C  -2.824993 0.219465 1.067326
C  2.447023 2.554073 0.487749
C  -2.455748 2.54601 -0.488065
C  3.757209 1.282841 -1.140121
C  -3.761143 1.270527 1.140323
C  3.571063 2.451537 -0.363486
C  -3.579148 2.439792 0.363564
H  -1.130908 -4.460768 -1.094463
H  -0.426679 -3.186037 -2.139072
H  0.635421 -4.456734 -1.448469
H  1.145248 -4.456967 1.094431
H  0.437067 -3.18421 2.138773
H  -0.621072 -4.458382 1.448498
H  0.646346 1.59092 1.226614
H  -0.652109 1.588787 -1.227485
H  2.966324 -0.688616 -1.647662
H  -2.963536 -0.698248 1.647711
H  2.304221 3.4494 1.102558
H  -2.316125 3.441771 -1.102973
H  4.629386 1.193933 -1.797001
H  -4.632794 1.178764 1.797507
H  4.296702 3.270609 -0.417906
H  -4.307476 3.25646 0.418182
